program: Orca
programVersion: 5.0.2
elementType: O O O N C C C C C C C C C C C C C C C C C C C C C C C C H H H H H H H H H H H H H H H H H H H H H H H H H
charge: 0
multiplicity: 1
keywords: wb97x-d3
keywords: def2-TZVPP
keywords: def2/J RIJCOSX
keywords: DEFGRID2
keywords: scfconv7
keywords: smallprint printgap noloewdin
keywords: NOSOSCF
formula: C24H25NO3
InChI: InChI=1/C24H25NO3/c1-16(2)13-20-22(24(20,3)4)23(26)28-21(15-25)17-9-8-12-19(14-17)27-18-10-6-5-7-11-18/h5-14,20-22H,1-4H3
53 atoms
O  -1.040028 1.913694 -0.65094
O  0.685716 0.502008 -0.486259
O  -2.176173 -3.820579 0.104801
N  -3.902746 2.07981 -2.266474
C  1.384093 2.520691 1.864109
C  2.320135 2.722403 0.711472
C  0.828762 2.704905 0.457595
C  1.338426 1.166817 2.52806
C  1.126488 3.658716 2.820002
C  3.052119 3.987954 0.492546
C  0.206009 1.585655 -0.258757
C  4.373755 4.11892 0.34362
C  5.351227 2.984902 0.40139
C  4.987774 5.463084 0.091407
C  -1.805872 0.884626 -1.264466
C  -2.221531 -0.177913 -0.273693
C  -2.977208 1.567613 -1.814914
C  -2.000824 -1.511797 -0.578116
C  -2.794636 0.190596 0.938234
C  -2.341165 -2.48531 0.352721
C  -3.140978 -0.793941 1.849417
C  -2.908109 -2.132434 1.568036
C  -1.06509 -4.268579 -0.567789
C  -1.245174 -5.351322 -1.416635
C  0.196376 -3.718141 -0.374585
C  -0.150616 -5.889884 -2.077609
C  1.279399 -4.261434 -1.051258
C  1.11426 -5.345261 -1.903401
H  2.834902 1.819568 0.400136
H  0.358077 3.666028 0.281861
H  1.642123 0.354291 1.87152
H  2.01456 1.159926 3.384781
H  0.336082 0.945944 2.900669
H  1.913121 3.702373 3.575788
H  1.086522 4.627649 2.32441
H  0.177666 3.513161 3.339129
H  2.444842 4.886996 0.439606
H  6.163948 3.218509 1.094217
H  4.909611 2.04119 0.718114
H  5.817448 2.825693 -0.575493
H  5.56165 5.462116 -0.838943
H  4.239063 6.252138 0.024235
H  5.689912 5.729191 0.885766
H  -1.266782 0.43569 -2.105106
H  -1.55973 -1.781469 -1.530134
H  -2.969755 1.23266 1.174295
H  -3.586731 -0.519343 2.79585
H  -3.167512 -2.899438 2.286251
H  -2.233818 -5.770403 -1.554746
H  0.343554 -2.876737 0.291021
H  -0.293348 -6.734865 -2.738221
H  2.261671 -3.832293 -0.903378
H  1.964784 -5.761959 -2.425872
elementType: O N C H
totalener: -1210.09327427 hartree
nucrepener: 2465.51146869 hartree
electener: -3675.60474296 hartree
oneelecener: -6542.45361174 hartree
twoeener: 2866.84886878 hartree
cpcmener: -0.03572208 hartree
kineticenergy: 1204.69353493 hartree
xcener: -118.581770541523 hartree
chargesum: -0.0000000
charge: -0.280559 -0.470620 -0.338813 -0.101633 0.120998 0.045149 -0.106523 -0.276020 -0.267054 -0.295338 0.391369 -0.034522 -0.257266 -0.222484 0.413332 0.023329 -0.219493 -0.202331 -0.240217 0.285802 -0.125434 -0.224126 0.297044 -0.258605 -0.196377 -0.121214 -0.148787 -0.191262 0.095241 0.094143 0.092435 0.100332 0.096922 0.098234 0.090249 0.098523 0.122499 0.094172 0.091310 0.099911 0.093808 0.089204 0.094934 0.143424 0.149895 0.149164 0.162750 0.151356 0.148692 0.158682 0.161664 0.162912 0.161196
qa: -0.2806 -0.4706 -0.3388 -0.1016 0.1210 0.0451 -0.1065 -0.2760 -0.2671 -0.2953 0.3914 -0.0345 -0.2573 -0.2225 0.4133 0.0233 -0.2195 -0.2023 -0.2402 0.2858 -0.1254 -0.2241 0.2970 -0.2586 -0.1964 -0.1212 -0.1488 -0.1913 0.0952 0.0941 0.0924 0.1003 0.0969 0.0982 0.0902 0.0985 0.1225 0.0942 0.0913 0.0999 0.0938 0.0892 0.0949 0.1434 0.1499 0.1492 0.1627 0.1514 0.1487 0.1587 0.1617 0.1629 0.1612
va: 2.1247 2.0342 2.0705 3.1103 3.6878 3.7758 3.8589 3.9067 3.9040 3.8809 4.1751 3.7334 3.9444 3.9227 3.7210 3.5730 4.0839 3.9490 3.9612 3.7106 3.8996 4.0090 3.6729 4.0075 3.8997 3.8761 3.8902 3.9037 1.0288 1.0372 1.0143 1.0016 1.0005 1.0020 1.0044 1.0024 1.0087 0.9979 1.0077 0.9960 0.9952 1.0086 0.9966 1.0169 1.0044 1.0114 0.9880 1.0037 1.0076 0.9976 0.9877 0.9893 0.9893
dispcorr: -0.025572351 hartree
energy: -1210.118846625242
dipole: 32.55680 -30.70660 1.85020 20.34908 -20.19860 0.15048 14.08760 -12.86984 1.21776
magnitude: 2.22010 au
magnitude: 5.64303 debye
