program: Orca
programVersion: 5.0.2
elementType: O O O N C C C C C C C C C C C C C C C C C C C C C C C C H H H H H H H H H H H H H H H H H H H H H H H H H
charge: 0
multiplicity: 1
keywords: wb97x-d3
keywords: def2-TZVPP
keywords: def2/J RIJCOSX
keywords: DEFGRID2
keywords: scfconv7
keywords: smallprint printgap noloewdin
keywords: NOSOSCF
formula: C24H25NO3
InChI: InChI=1/C24H25NO3/c1-16(2)13-20-22(24(20,3)4)23(26)28-21(15-25)17-9-8-12-19(14-17)27-18-10-6-5-7-11-18/h5-14,20-22H,1-4H3
53 atoms
O  -0.896263 0.956585 1.408357
O  -0.930875 2.447124 -0.256572
O  -1.91201 -3.373854 -1.300331
N  -3.116926 -0.325665 3.487715
C  2.054586 1.417363 -0.49795
C  2.030242 2.810007 0.056311
C  1.159208 1.748487 0.689678
C  1.453043 1.174728 -1.859906
C  3.22662 0.516395 -0.197954
C  3.149539 3.368401 0.846221
C  -0.299661 1.791003 0.534795
C  3.86288 4.457793 0.543944
C  3.65702 5.29577 -0.680218
C  4.963175 4.928074 1.44688
C  -2.30369 0.798875 1.273074
C  -2.662861 -0.065235 0.087404
C  -2.739116 0.167942 2.519951
C  -2.084334 -1.324058 -0.033935
C  -3.551734 0.404378 -0.866456
C  -2.402315 -2.109582 -1.131438
C  -3.87091 -0.401159 -1.951448
C  -3.295989 -1.652301 -2.09358
C  -0.668159 -3.701497 -0.811391
C  -0.557146 -4.872673 -0.078811
C  0.450109 -2.92828 -1.09575
C  0.69314 -5.280433 0.366537
C  1.691388 -3.342794 -0.636388
C  1.819498 -4.517249 0.094189
H  1.490486 3.518889 -0.563311
H  1.499642 1.341882 1.635578
H  2.240028 1.211127 -2.615449
H  0.990831 0.186773 -1.916758
H  0.705464 1.914219 -2.138785
H  2.940822 -0.530624 -0.31465
H  4.045357 0.714547 -0.892312
H  3.609719 0.642579 0.813698
H  3.404994 2.832665 1.756154
H  2.859385 4.939215 -1.329002
H  3.429978 6.329331 -0.406799
H  4.573751 5.330944 -1.274149
H  4.773249 5.946199 1.796301
H  5.079685 4.287986 2.320887
H  5.919295 4.958027 0.918409
H  -2.810967 1.766254 1.203753
H  -1.402187 -1.686878 0.725948
H  -3.991708 1.387816 -0.764225
H  -4.563474 -0.045649 -2.702339
H  -3.53887 -2.277198 -2.943454
H  -1.438733 -5.463712 0.133653
H  0.361019 -2.017647 -1.675241
H  0.781247 -6.196894 0.934755
H  2.565004 -2.744244 -0.859486
H  2.791841 -4.835669 0.445277
elementType: O N C H
totalener: -1210.09382883 hartree
nucrepener: 2518.52217181 hartree
electener: -3728.61600064 hartree
oneelecener: -6648.20153713 hartree
twoeener: 2919.58553649 hartree
cpcmener: -0.03688827 hartree
kineticenergy: 1204.69672470 hartree
xcener: -118.582517502860 hartree
chargesum: 0.0000000
charge: -0.285352 -0.468409 -0.338037 -0.101554 0.128889 0.026608 -0.101962 -0.274727 -0.264938 -0.291626 0.388954 -0.037381 -0.251525 -0.223500 0.429753 0.015958 -0.226361 -0.199097 -0.211494 0.254029 -0.110446 -0.240862 0.262496 -0.231347 -0.201713 -0.131489 -0.166328 -0.180108 0.096350 0.094227 0.100655 0.088102 0.096438 0.088145 0.099101 0.091984 0.123414 0.089344 0.096450 0.096415 0.094669 0.089648 0.093837 0.142639 0.146742 0.150314 0.162337 0.150353 0.148743 0.193514 0.161573 0.176130 0.160446
qa: -0.2854 -0.4684 -0.3380 -0.1016 0.1289 0.0266 -0.1020 -0.2747 -0.2649 -0.2916 0.3890 -0.0374 -0.2515 -0.2235 0.4298 0.0160 -0.2264 -0.1991 -0.2115 0.2540 -0.1104 -0.2409 0.2625 -0.2313 -0.2017 -0.1315 -0.1663 -0.1801 0.0964 0.0942 0.1007 0.0881 0.0964 0.0881 0.0991 0.0920 0.1234 0.0893 0.0965 0.0964 0.0947 0.0896 0.0938 0.1426 0.1467 0.1503 0.1623 0.1504 0.1487 0.1935 0.1616 0.1761 0.1604
va: 2.1252 2.0397 2.0704 3.1109 3.6684 3.7902 3.8713 3.8963 3.9107 3.8762 4.1875 3.7363 3.9445 3.9221 3.7090 3.5993 4.0900 3.9265 3.9651 3.7511 3.8958 4.0081 3.7250 4.0016 3.9110 3.8820 3.8951 3.9119 1.0283 1.0371 1.0023 1.0045 1.0174 1.0102 1.0028 1.0055 1.0080 1.0091 0.9969 0.9973 0.9957 1.0083 0.9965 1.0166 1.0166 1.0035 0.9878 1.0048 1.0064 0.9700 0.9878 0.9812 0.9905
dispcorr: -0.027258278 hartree
energy: -1210.121087109706
dipole: 33.84279 -32.02853 1.81426 20.06665 -19.57559 0.49106 -7.02682 5.76039 -1.26643
magnitude: 2.26639 au
magnitude: 5.76071 debye
