program: Orca
programVersion: 5.0.2
elementType: O O O N C C C C C C C C C C C C C C C C C C C C C C C C H H H H H H H H H H H H H H H H H H H H H H H H H
charge: 0
multiplicity: 1
keywords: wb97x-d3
keywords: def2-TZVPP
keywords: def2/J RIJCOSX
keywords: DEFGRID2
keywords: scfconv7
keywords: smallprint printgap noloewdin
keywords: NOSOSCF
formula: C24H25NO3
InChI: InChI=1/C24H25NO3/c1-16(2)13-20-22(24(20,3)4)23(26)28-21(15-25)17-9-8-12-19(14-17)27-18-10-6-5-7-11-18/h5-14,20-22H,1-4H3
53 atoms
O  -1.368005 1.565753 -1.231243
O  -1.109056 1.71193 0.981333
O  -1.315987 -3.450495 -0.529621
N  -4.039883 3.126193 0.149474
C  1.473968 3.305503 0.06028
C  1.853203 1.952445 0.574949
C  0.765312 2.067862 -0.475712
C  0.759926 4.253743 0.990845
C  2.376387 4.011885 -0.921636
C  3.120358 1.287532 0.212321
C  -0.625158 1.769816 -0.12217
C  3.972054 0.693381 1.054067
C  3.78477 0.598331 2.537155
C  5.213901 0.029402 0.540715
C  -2.72533 1.206261 -1.04827
C  -2.902917 -0.154735 -0.405298
C  -3.445805 2.273522 -0.343592
C  -2.010218 -1.161024 -0.750746
C  -3.959316 -0.42475 0.454583
C  -2.1640 -2.42546 -0.200909
C  -4.115369 -1.703344 0.970377
C  -3.215005 -2.708717 0.657817
C  0.040554 -3.234309 -0.516172
C  0.79609 -3.921177 -1.456139
C  0.651266 -2.41468 0.425614
C  2.177175 -3.783322 -1.453366
C  2.03245 -2.284463 0.412482
C  2.801569 -2.961046 -0.524939
H  1.479964 1.743346 1.571695
H  1.039324 1.793306 -1.488027
H  1.493265 4.893369 1.485461
H  0.076478 4.903728 0.440981
H  0.193987 3.749304 1.771224
H  3.18615 4.519238 -0.393792
H  2.824031 3.33722 -1.649825
H  1.817143 4.768777 -1.474118
H  3.370159 1.282255 -0.844605
H  2.888433 1.093264 2.903718
H  3.738961 -0.448036 2.850459
H  4.640015 1.035463 3.058056
H  5.306675 0.106462 -0.542367
H  6.108196 0.468485 0.990203
H  5.226068 -1.031404 0.806728
H  -3.137647 1.177088 -2.060762
H  -1.196329 -0.969721 -1.439298
H  -4.66579 0.347182 0.730792
H  -4.938073 -1.91281 1.640471
H  -3.325141 -3.701515 1.074269
H  0.306839 -4.559326 -2.181266
H  0.067994 -1.885514 1.168516
H  2.764239 -4.319506 -2.187607
H  2.507105 -1.652978 1.151576
H  3.878064 -2.851231 -0.527006
elementType: O N C H
totalener: -1210.09305810 hartree
nucrepener: 2586.50314202 hartree
electener: -3796.59620012 hartree
oneelecener: -6784.64765079 hartree
twoeener: 2988.05145067 hartree
cpcmener: -0.03837427 hartree
kineticenergy: 1204.69804500 hartree
xcener: -118.588341382402 hartree
chargesum: -0.0000000
charge: -0.295168 -0.468753 -0.342250 -0.095977 0.105206 0.065591 -0.105951 -0.273267 -0.270719 -0.290776 0.419832 -0.076718 -0.254323 -0.232716 0.529291 -0.040904 -0.252915 -0.229956 -0.194797 0.249321 -0.115937 -0.231659 0.309707 -0.267290 -0.212780 -0.105678 -0.132949 -0.230265 0.099106 0.092887 0.099069 0.100692 0.091388 0.098665 0.090377 0.098686 0.123799 0.091946 0.093453 0.106747 0.094733 0.106731 0.088489 0.150403 0.151388 0.135714 0.162949 0.150983 0.148532 0.150452 0.160928 0.196574 0.158110
qa: -0.2952 -0.4688 -0.3423 -0.0960 0.1052 0.0656 -0.1060 -0.2733 -0.2707 -0.2908 0.4198 -0.0767 -0.2543 -0.2327 0.5293 -0.0409 -0.2529 -0.2300 -0.1948 0.2493 -0.1159 -0.2317 0.3097 -0.2673 -0.2128 -0.1057 -0.1329 -0.2303 0.0991 0.0929 0.0991 0.1007 0.0914 0.0987 0.0904 0.0987 0.1238 0.0919 0.0935 0.1067 0.0947 0.1067 0.0885 0.1504 0.1514 0.1357 0.1629 0.1510 0.1485 0.1505 0.1609 0.1966 0.1581
va: 2.1292 2.0296 2.0648 3.1013 3.7375 3.7265 3.8594 3.9060 3.9062 3.8257 4.1105 3.7647 3.9341 3.9116 3.7644 3.7327 4.1068 3.9623 3.9371 3.7388 3.9119 4.0230 3.6539 4.0199 3.9063 3.8947 3.8142 3.9341 1.0271 1.0374 1.0002 1.0001 1.0170 1.0016 1.0061 1.0019 1.0104 1.0099 0.9966 0.9975 1.0066 0.9991 0.9937 0.9871 1.0124 1.0160 0.9885 1.0033 1.0074 1.0075 0.9881 0.9518 0.9930
dispcorr: -0.029161124 hartree
energy: -1210.122219222622
dipole: 33.45494 -31.51328 1.94165 10.65066 -11.49532 -0.84467 6.13256 -7.35364 -1.22108
magnitude: 2.44428 au
magnitude: 6.21287 debye
