program: Orca
programVersion: 5.0.2
elementType: O O O N C C C C C C C C C C C C C C C C C C C C C C C C H H H H H H H H H H H H H H H H H H H H H H H H H
charge: 0
multiplicity: 1
keywords: wb97x-d3
keywords: def2-TZVPP
keywords: def2/J RIJCOSX
keywords: DEFGRID2
keywords: scfconv7
keywords: smallprint printgap noloewdin
keywords: NOSOSCF
formula: C24H25NO3
InChI: InChI=1/C24H25NO3/c1-16(2)13-20-22(24(20,3)4)23(26)28-21(15-25)17-9-8-12-19(14-17)27-18-10-6-5-7-11-18/h5-14,20-22H,1-4H3
53 atoms
O  -1.172633 2.012079 -0.425711
O  0.478082 0.515956 -0.619267
O  -2.136739 -3.69006 -0.259423
N  -4.122604 2.562604 -1.792133
C  1.414781 2.104524 1.971529
C  2.319467 2.376233 0.807436
C  0.82275 2.529138 0.63438
C  1.262429 0.681272 2.449605
C  1.304444 3.115015 3.086031
C  3.167575 3.582387 0.719571
C  0.078072 1.571188 -0.192457
C  4.456633 3.625576 0.366969
C  5.288371 2.432431 0.008089
C  5.187075 4.933258 0.296269
C  -2.03591 1.131399 -1.139069
C  -2.455615 -0.046116 -0.29188
C  -3.196079 1.946923 -1.500729
C  -2.120758 -1.32569 -0.7035
C  -3.125561 0.15905 0.909488
C  -2.439472 -2.405883 0.108376
C  -3.459207 -0.931803 1.695785
C  -3.109465 -2.21739 1.306647
C  -0.892496 -3.967309 -0.772992
C  0.259031 -3.33497 -0.31833
C  -0.822991 -4.95677 -1.743435
C  1.485606 -3.699558 -0.855668
C  0.412165 -5.317451 -2.262531
C  1.570284 -4.68767 -1.827449
H  2.727852 1.480647 0.351893
H  0.434436 3.541363 0.612335
H  0.262485 0.508921 2.85265
H  1.445312 -0.058153 1.672354
H  1.976829 0.489374 3.252126
H  0.371158 2.974731 3.634088
H  2.125383 2.990122 3.79476
H  1.325404 4.143981 2.730256
H  2.68002 4.523761 0.956117
H  6.197831 2.407262 0.612994
H  4.778523 1.480781 0.14204
H  5.615521 2.491928 -1.033195
H  6.038664 4.944226 0.981416
H  5.595874 5.098548 -0.704035
H  4.545377 5.779114 0.541577
H  -1.571232 0.787468 -2.068577
H  -1.604552 -1.473764 -1.644111
H  -3.387757 1.158755 1.233065
H  -3.9833 -0.782785 2.630071
H  -3.354025 -3.067733 1.930024
H  0.21332 -2.569723 0.446657
H  -1.728236 -5.442016 -2.085657
H  2.38211 -3.205938 -0.504226
H  0.463944 -6.089947 -3.018544
H  2.530838 -4.965177 -2.240045
elementType: O N C H
totalener: -1210.09359925 hartree
nucrepener: 2492.16089036 hartree
electener: -3702.25448961 hartree
oneelecener: -6595.78286223 hartree
twoeener: 2893.52837262 hartree
cpcmener: -0.03575459 hartree
kineticenergy: 1204.69527239 hartree
xcener: -118.582218935909 hartree
chargesum: -0.0000000
charge: -0.277740 -0.472063 -0.342010 -0.102306 0.107896 0.042651 -0.095824 -0.267169 -0.270392 -0.289396 0.397630 -0.045982 -0.254721 -0.219778 0.419146 0.022949 -0.220079 -0.191621 -0.228335 0.262489 -0.130307 -0.216524 0.286417 -0.187191 -0.246452 -0.160542 -0.127798 -0.185282 0.094088 0.095227 0.097720 0.085535 0.100943 0.097920 0.098883 0.089966 0.122503 0.095314 0.090668 0.098801 0.094217 0.093488 0.089363 0.139837 0.150525 0.148851 0.163315 0.151602 0.160269 0.148375 0.162256 0.160988 0.161680
qa: -0.2777 -0.4721 -0.3420 -0.1023 0.1079 0.0427 -0.0958 -0.2672 -0.2704 -0.2894 0.3976 -0.0460 -0.2547 -0.2198 0.4191 0.0229 -0.2201 -0.1916 -0.2283 0.2625 -0.1303 -0.2165 0.2864 -0.1872 -0.2465 -0.1605 -0.1278 -0.1853 0.0941 0.0952 0.0977 0.0855 0.1009 0.0979 0.0989 0.0900 0.1225 0.0953 0.0907 0.0988 0.0942 0.0935 0.0894 0.1398 0.1505 0.1489 0.1633 0.1516 0.1603 0.1484 0.1623 0.1610 0.1617
va: 2.1330 2.0332 2.0659 3.1099 3.6994 3.7803 3.8348 3.9103 3.9058 3.8728 4.1806 3.7548 3.9418 3.9205 3.7222 3.5523 4.0778 3.9356 3.9684 3.7272 3.9022 4.0171 3.6854 3.8783 3.9971 3.9015 3.8846 3.8992 1.0297 1.0347 1.0004 1.0135 1.0017 1.0020 1.0017 1.0057 1.0096 0.9976 1.0097 0.9958 0.9966 0.9957 1.0087 1.0162 1.0076 1.0094 0.9881 1.0032 0.9927 1.0073 0.9899 0.9879 0.9890
dispcorr: -0.026160129 hartree
energy: -1210.119759378916
dipole: 33.92172 -32.03510 1.88662 15.94934 -16.01444 -0.06511 13.97203 -12.79755 1.17448
magnitude: 2.22328 au
magnitude: 5.65112 debye
