program: Orca
programVersion: 5.0.2
elementType: O O O N C C C C C C C C C C C C C C C C C C C C C C C C H H H H H H H H H H H H H H H H H H H H H H H H H
charge: 0
multiplicity: 1
keywords: wb97x-d3
keywords: def2-TZVPP
keywords: def2/J RIJCOSX
keywords: DEFGRID2
keywords: scfconv7
keywords: smallprint printgap noloewdin
keywords: NOSOSCF
formula: C24H25NO3
InChI: InChI=1/C24H25NO3/c1-16(2)13-20-22(24(20,3)4)23(26)28-21(15-25)17-9-8-12-19(14-17)27-18-10-6-5-7-11-18/h5-14,20-22H,1-4H3
53 atoms
O  -0.625646 1.304227 0.277418
O  -0.899293 3.073039 1.601357
O  -1.539462 -3.767755 -0.678066
N  -2.742187 0.47818 2.826949
C  2.386525 1.67121 0.755634
C  1.993782 2.239935 -0.562907
C  1.24837 2.682079 0.69013
C  2.127368 0.21025 1.037082
C  3.63394 2.184049 1.435561
C  2.833085 3.211763 -1.309167
C  -0.173375 2.394134 0.916291
C  2.356211 4.104414 -2.181096
C  0.893626 4.247552 -2.478641
C  3.265357 5.009294 -2.953456
C  -2.01353 1.01586 0.371398
C  -2.280596 -0.182587 -0.502789
C  -2.399235 0.735062 1.761095
C  -1.769991 -1.424657 -0.138758
C  -3.005091 -0.028511 -1.673679
C  -1.984324 -2.515279 -0.967732
C  -3.224452 -1.133799 -2.486555
C  -2.715989 -2.373182 -2.143635
C  -0.49852 -3.932288 0.203583
C  0.75637 -3.406108 -0.074565
C  -0.722088 -4.679755 1.348233
C  1.795245 -3.629516 0.816637
C  0.329856 -4.906487 2.22612
C  1.586531 -4.377962 1.968385
H  1.423833 1.560416 -1.191472
H  1.506617 3.665425 1.06649
H  3.033302 -0.36084 0.823816
H  1.878186 0.044732 2.087051
H  1.331406 -0.213919 0.429246
H  3.789078 3.252392 1.284136
H  3.57946 2.009971 2.511855
H  4.518106 1.662235 1.063355
H  3.907538 3.153454 -1.159711
H  0.257718 3.91192 -1.658967
H  0.635412 5.285387 -2.698492
H  0.616981 3.664342 -3.362516
H  3.111771 4.891439 -4.029731
H  3.058573 6.058798 -2.727377
H  4.317259 4.818641 -2.740629
H  -2.608653 1.868506 0.029868
H  -1.21981 -1.536673 0.788082
H  -3.396032 0.941996 -1.951063
H  -3.791515 -1.025361 -3.401598
H  -2.883285 -3.233609 -2.779315
H  0.922936 -2.831848 -0.977793
H  -1.7064 -5.084543 1.547667
H  2.775012 -3.221641 0.603947
H  0.159492 -5.493908 3.1191
H  2.40158 -4.551505 2.658623
elementType: O N C H
totalener: -1210.10349863 hartree
nucrepener: 2534.00883486 hartree
electener: -3744.11233349 hartree
oneelecener: -6679.01371913 hartree
twoeener: 2934.90138565 hartree
cpcmener: -0.03344471 hartree
kineticenergy: 1204.70667112 hartree
xcener: -118.582167076735 hartree
chargesum: -0.0000000
charge: -0.269617 -0.447694 -0.327188 -0.087096 0.174396 0.006247 -0.123415 -0.266277 -0.293609 -0.318887 0.400848 0.007042 -0.268815 -0.225039 0.393457 0.011082 -0.233515 -0.222078 -0.200549 0.256681 -0.114102 -0.228414 0.270447 -0.199834 -0.216915 -0.156049 -0.135178 -0.161749 0.108339 0.093998 0.094957 0.105161 0.068737 0.093171 0.100103 0.099578 0.121830 0.091863 0.095979 0.106932 0.096379 0.094749 0.087242 0.131063 0.147155 0.145903 0.158589 0.147374 0.158852 0.147284 0.163724 0.158044 0.158815
qa: -0.2696 -0.4477 -0.3272 -0.0871 0.1744 0.0062 -0.1234 -0.2663 -0.2936 -0.3189 0.4008 0.0070 -0.2688 -0.2250 0.3935 0.0111 -0.2335 -0.2221 -0.2005 0.2567 -0.1141 -0.2284 0.2704 -0.1998 -0.2169 -0.1560 -0.1352 -0.1617 0.1083 0.0940 0.0950 0.1052 0.0687 0.0932 0.1001 0.0996 0.1218 0.0919 0.0960 0.1069 0.0964 0.0947 0.0872 0.1311 0.1472 0.1459 0.1586 0.1474 0.1589 0.1473 0.1637 0.1580 0.1588
va: 2.1479 2.0550 2.0883 3.1116 3.7264 3.7843 3.9010 3.8915 3.9150 3.8731 4.1202 3.6878 3.9522 3.9316 3.7688 3.7137 4.0291 3.9318 3.9491 3.7865 3.9102 4.0050 3.6868 3.9171 4.0078 3.8622 3.8932 3.9003 1.0163 1.0285 1.0018 0.9999 1.0073 1.0025 1.0021 0.9993 1.0049 1.0043 1.0019 0.9957 0.9944 0.9962 1.0076 1.0168 1.0088 1.0018 0.9894 1.0064 0.9966 1.0055 0.9873 0.9892 0.9901
dispcorr: -0.027709846 hartree
energy: -1210.131208471535
dipole: 26.25883 -24.66479 1.59404 17.98354 -18.15855 -0.17501 -10.01649 7.57507 -2.44143
magnitude: 2.92098 au
magnitude: 7.42455 debye
