program: Orca
programVersion: 5.0.2
elementType: O O O N C C C C C C C C C C C C C C C C C C C C C C C C H H H H H H H H H H H H H H H H H H H H H H H H H
charge: 0
multiplicity: 1
keywords: wb97x-d3
keywords: def2-TZVPP
keywords: def2/J RIJCOSX
keywords: DEFGRID2
keywords: scfconv7
keywords: smallprint printgap noloewdin
keywords: NOSOSCF
formula: C24H25NO3
InChI: InChI=1/C24H25NO3/c1-16(2)13-20-22(24(20,3)4)23(26)28-21(15-25)17-9-8-12-19(14-17)27-18-10-6-5-7-11-18/h5-14,20-22H,1-4H3
53 atoms
O  -0.783114 1.630785 -0.23516
O  -1.29571 3.701124 0.415709
O  -0.396305 -3.330532 0.352797
N  -2.565055 1.44061 2.659475
C  1.46697 4.497001 -0.83737
C  1.708093 4.136152 0.586562
C  0.935016 3.175658 -0.306481
C  0.531714 5.635528 -1.162121
C  2.601519 4.359447 -1.824729
C  3.049491 3.747553 1.092379
C  -0.478642 2.923981 -0.010958
C  3.305706 2.704134 1.885251
C  2.255587 1.753593 2.375705
C  4.700435 2.395094 2.335613
C  -2.090264 1.196922 0.095627
C  -2.203665 -0.262957 -0.266733
C  -2.340534 1.363466 1.535272
C  -1.23382 -1.157943 0.168273
C  -3.283949 -0.703579 -1.016156
C  -1.356443 -2.502848 -0.144947
C  -3.39842 -2.054701 -1.313466
C  -2.445697 -2.961555 -0.880274
C  -0.0524 -4.478174 -0.312537
C  0.21691 -4.481934 -1.675785
C  0.083464 -5.633865 0.441823
C  0.61327 -5.664668 -2.282487
C  0.495106 -6.806578 -0.176076
C  0.753977 -6.829457 -1.539266
H  1.079027 4.671605 1.294933
H  1.482256 2.29814 -0.630705
H  -0.196207 5.831293 -0.3782
H  1.111478 6.550189 -1.302103
H  -0.012138 5.450223 -2.090547
H  2.21435 4.227472 -2.83696
H  3.223375 5.257086 -1.824565
H  3.246951 3.508823 -1.605046
H  3.877151 4.385694 0.793469
H  2.334817 0.78909 1.865442
H  2.392018 1.549015 3.44011
H  1.239564 2.119406 2.240407
H  5.43322 3.08326 1.914243
H  4.780532 2.440663 3.424812
H  4.9874 1.379757 2.048446
H  -2.848334 1.776868 -0.43985
H  -0.38579 -0.82445 0.755508
H  -4.033512 -0.002655 -1.360405
H  -4.243848 -2.409141 -1.888152
H  -2.559121 -4.012678 -1.112346
H  0.123587 -3.575765 -2.261458
H  -0.124693 -5.612702 1.504269
H  0.820115 -5.670303 -3.344911
H  0.604295 -7.707419 0.413863
H  1.067254 -7.747064 -2.019596
elementType: O N C H
totalener: -1210.10540524 hartree
nucrepener: 2434.25703086 hartree
electener: -3644.36243610 hartree
oneelecener: -6479.96201769 hartree
twoeener: 2835.59958159 hartree
cpcmener: -0.03171713 hartree
kineticenergy: 1204.71264795 hartree
xcener: -118.583392717631 hartree
chargesum: -0.0000000
charge: -0.283247 -0.447041 -0.324071 -0.090846 0.148780 -0.000123 -0.120502 -0.283640 -0.282317 -0.300227 0.382718 -0.010964 -0.237093 -0.227251 0.423897 0.001789 -0.236235 -0.226762 -0.191169 0.236558 -0.135652 -0.179268 0.271543 -0.188861 -0.237358 -0.144613 -0.126453 -0.178366 0.109351 0.098602 0.094691 0.093857 0.099482 0.098310 0.098845 0.093101 0.121333 0.103696 0.103061 0.081667 0.088716 0.096619 0.093844 0.128296 0.139375 0.145594 0.160728 0.156373 0.158425 0.146731 0.159404 0.157972 0.158703
qa: -0.2832 -0.4470 -0.3241 -0.0908 0.1488 -0.0001 -0.1205 -0.2836 -0.2823 -0.3002 0.3827 -0.0110 -0.2371 -0.2273 0.4239 0.0018 -0.2362 -0.2268 -0.1912 0.2366 -0.1357 -0.1793 0.2715 -0.1889 -0.2374 -0.1446 -0.1265 -0.1784 0.1094 0.0986 0.0947 0.0939 0.0995 0.0983 0.0988 0.0931 0.1213 0.1037 0.1031 0.0817 0.0887 0.0966 0.0938 0.1283 0.1394 0.1456 0.1607 0.1564 0.1584 0.1467 0.1594 0.1580 0.1587
va: 2.1436 2.0566 2.0809 3.1063 3.7032 3.8052 3.8513 3.8926 3.9093 3.8949 4.1437 3.7112 3.9343 3.9324 3.7365 3.7452 4.0212 4.0686 3.9612 3.8243 3.9121 3.9050 3.6929 3.9188 4.0064 3.8901 3.8872 3.9008 1.0205 1.0252 1.0181 1.0008 0.9993 1.0029 1.0006 1.0026 1.0042 0.9976 1.0005 1.0095 1.0063 0.9967 0.9966 1.0195 1.0259 1.0029 0.9911 0.9962 0.9954 1.0073 0.9903 0.9893 0.9901
dispcorr: -0.025245772 hartree
energy: -1210.130651014511
dipole: 24.20900 -23.16276 1.04624 16.55607 -17.85277 -1.29671 -3.38748 0.91536 -2.47212
magnitude: 2.98118 au
magnitude: 7.57755 debye
