program: Orca
programVersion: 5.0.2
elementType: O O O N C C C C C C C C C C C C C C C C C C C C C C C C H H H H H H H H H H H H H H H H H H H H H H H H H
charge: 0
multiplicity: 1
keywords: wb97x-d3
keywords: def2-TZVPP
keywords: def2/J RIJCOSX
keywords: DEFGRID2
keywords: scfconv7
keywords: smallprint printgap noloewdin
keywords: NOSOSCF
formula: C24H25NO3
InChI: InChI=1/C24H25NO3/c1-16(2)13-20-22(24(20,3)4)23(26)28-21(15-25)17-9-8-12-19(14-17)27-18-10-6-5-7-11-18/h5-14,20-22H,1-4H3
53 atoms
O  -0.723075 2.089602 0.166798
O  0.071214 1.495069 -1.829605
O  -2.018618 -3.511087 -1.173859
N  -3.586957 1.900607 1.764909
C  1.059468 4.584451 -0.193171
C  1.627738 3.621108 0.803389
C  1.253751 3.127525 -0.58664
C  -0.319042 5.148697 0.055717
C  1.966853 5.568028 -0.893947
C  3.046612 3.613053 1.205162
C  0.167025 2.168114 -0.834119
C  3.527628 3.336934 2.42258
C  2.69722 2.981137 3.618598
C  5.004941 3.350178 2.679813
C  -1.792774 1.172343 0.009674
C  -1.37503 -0.258003 0.264192
C  -2.790483 1.590867 0.997817
C  -1.828903 -1.253568 -0.586151
C  -0.56109 -0.569287 1.347408
C  -1.48449 -2.576698 -0.339386
C  -0.213446 -1.891796 1.570929
C  -0.672946 -2.903244 0.739336
C  -1.329291 -4.666604 -1.440391
C  -2.000151 -5.869011 -1.281513
C  -0.024627 -4.633912 -1.91627
C  -1.356697 -7.054743 -1.609914
C  0.609106 -5.826572 -2.232122
C  -0.051861 -7.038983 -2.081485
H  0.926546 3.334432 1.578135
H  2.080383 2.963002 -1.269086
H  -0.854607 5.312404 -0.881757
H  -0.938118 4.522754 0.694548
H  -0.227428 6.117901 0.550298
H  1.499425 5.924763 -1.813869
H  2.151161 6.437213 -0.259086
H  2.932592 5.143228 -1.164381
H  3.765181 3.842285 0.423729
H  1.625723 3.094438 3.466886
H  2.879885 1.945292 3.917607
H  2.974507 3.599886 4.475357
H  5.265117 4.090234 3.441523
H  5.345221 2.383807 3.061875
H  5.579707 3.577038 1.781754
H  -2.253601 1.262653 -0.979584
H  -2.453485 -1.009565 -1.437423
H  -0.200863 0.203758 2.014304
H  0.41714 -2.146288 2.412551
H  -0.403865 -3.931804 0.942764
H  -3.017515 -5.875873 -0.910823
H  0.490946 -3.690342 -2.047711
H  -1.880256 -7.994365 -1.489315
H  1.62496 -5.804433 -2.60502
H  0.447354 -7.965376 -2.33357
elementType: O N C H
totalener: -1210.10521291 hartree
nucrepener: 2424.79417812 hartree
electener: -3634.89939104 hartree
oneelecener: -6460.81484461 hartree
twoeener: 2825.91545357 hartree
cpcmener: -0.03188997 hartree
kineticenergy: 1204.70636655 hartree
xcener: -118.582979984157 hartree
chargesum: 0.0000000
charge: -0.276078 -0.441876 -0.326543 -0.087126 0.096530 0.065027 -0.098199 -0.266614 -0.279106 -0.290189 0.396699 -0.041638 -0.259539 -0.218666 0.367988 0.028458 -0.228608 -0.227227 -0.202642 0.246092 -0.157032 -0.157505 0.242226 -0.224543 -0.166614 -0.132226 -0.151177 -0.170614 0.099391 0.090059 0.100013 0.089514 0.095190 0.098092 0.098305 0.089329 0.115934 0.090016 0.099165 0.095436 0.093897 0.092036 0.087145 0.141900 0.134262 0.151974 0.159537 0.157115 0.146788 0.159641 0.157796 0.159377 0.158828
qa: -0.2761 -0.4419 -0.3265 -0.0871 0.0965 0.0650 -0.0982 -0.2666 -0.2791 -0.2902 0.3967 -0.0416 -0.2595 -0.2187 0.3680 0.0285 -0.2286 -0.2272 -0.2026 0.2461 -0.1570 -0.1575 0.2422 -0.2245 -0.1666 -0.1322 -0.1512 -0.1706 0.0994 0.0901 0.1000 0.0895 0.0952 0.0981 0.0983 0.0893 0.1159 0.0900 0.0992 0.0954 0.0939 0.0920 0.0871 0.1419 0.1343 0.1520 0.1595 0.1571 0.1468 0.1596 0.1578 0.1594 0.1588
va: 2.1138 2.0717 2.0720 3.1083 3.7039 3.7319 3.8435 3.9140 3.9190 3.8785 4.1757 3.7653 3.9408 3.9228 3.7597 3.6320 4.0695 4.0800 3.9532 3.7810 3.9398 3.8898 3.7204 4.0009 3.9170 3.8891 3.8940 3.8933 1.0198 1.0312 1.0001 1.0097 1.0004 1.0008 1.0011 1.0074 1.0128 1.0105 0.9958 0.9982 0.9963 0.9960 1.0093 1.0186 1.0182 1.0053 0.9914 0.9961 1.0066 0.9953 0.9895 0.9904 0.9900
dispcorr: -0.025035535 hartree
energy: -1210.130248449358
dipole: 26.18734 -24.26854 1.91880 23.66123 -23.91209 -0.25085 10.09274 -9.92267 0.17007
magnitude: 1.94259 au
magnitude: 4.93767 debye
