program: Orca
programVersion: 5.0.2
elementType: O O O N C C C C C C C C C C C C C C C C C C C C C C C C H H H H H H H H H H H H H H H H H H H H H H H H H
charge: 0
multiplicity: 1
keywords: wb97x-d3
keywords: def2-TZVPP
keywords: def2/J RIJCOSX
keywords: DEFGRID2
keywords: scfconv7
keywords: smallprint printgap noloewdin
keywords: NOSOSCF
formula: C24H25NO3
InChI: InChI=1/C24H25NO3/c1-16(2)13-20-22(24(20,3)4)23(26)28-21(15-25)17-9-8-12-19(14-17)27-18-10-6-5-7-11-18/h5-14,20-22H,1-4H3
53 atoms
O  -0.925822 1.244377 -1.097276
O  -1.124813 2.069083 0.96542
O  -1.56358 -3.924373 -0.142715
N  -3.943518 2.791551 -0.685372
C  1.463855 3.614851 -0.039533
C  1.803709 2.614052 1.02303
C  0.985905 2.173023 -0.166312
C  0.487583 4.715545 0.293084
C  2.529408 4.036603 -1.020537
C  3.17615 2.083997 1.20116
C  -0.435507 1.839206 0.00519
C  3.981111 2.360724 2.231516
C  3.613373 3.270378 3.363863
C  5.355048 1.76849 2.322579
C  -2.279922 0.8131 -1.078345
C  -2.497141 -0.378079 -0.173023
C  -3.196657 1.928188 -0.812964
C  -1.925196 -1.578907 -0.581052
C  -3.214346 -0.308946 1.012709
C  -2.060272 -2.707149 0.215044
C  -3.358882 -1.451193 1.787549
C  -2.778234 -2.6477 1.403364
C  -0.409393 -4.01619 -0.875244
C  -0.402259 -4.905055 -1.939874
C  0.734296 -3.303072 -0.535429
C  0.764527 -5.086572 -2.669224
C  1.88948 -3.484689 -1.281867
C  1.911698 -4.374181 -2.348483
H  1.227683 2.732517 1.935633
H  1.496691 1.59107 -0.926186
H  -0.206233 4.4484 1.088105
H  1.035387 5.599268 0.626732
H  -0.09702 5.005176 -0.582834
H  3.195494 3.220587 -1.299077
H  2.07821 4.421401 -1.937234
H  3.14353 4.833733 -0.595841
H  3.548577 1.4242 0.422141
H  2.612791 3.6915 3.280929
H  3.67885 2.746656 4.321673
H  4.316043 4.10628 3.423941
H  5.582482 1.11675 1.478263
H  6.117396 2.551769 2.35858
H  5.471195 1.1845 3.240211
H  -2.472785 0.509633 -2.110665
H  -1.387239 -1.62805 -1.520841
H  -3.666332 0.618115 1.339567
H  -3.919313 -1.404479 2.711957
H  -2.885186 -3.535196 2.014281
H  -1.301724 -5.453781 -2.190525
H  0.731924 -2.616232 0.302325
H  0.769816 -5.782696 -3.498249
H  2.781154 -2.930197 -1.018657
H  2.818487 -4.513765 -2.922264
elementType: O N C H
totalener: -1210.10522443 hartree
nucrepener: 2480.63792126 hartree
electener: -3690.74314570 hartree
oneelecener: -6572.79837853 hartree
twoeener: 2882.05523283 hartree
cpcmener: -0.03186576 hartree
kineticenergy: 1204.70149335 hartree
xcener: -118.583282710343 hartree
chargesum: -0.0000000
charge: -0.283849 -0.443880 -0.327586 -0.083221 0.146589 0.013747 -0.154139 -0.287909 -0.263085 -0.280202 0.431478 -0.027215 -0.251073 -0.226974 0.464139 -0.029321 -0.248391 -0.234055 -0.175466 0.264860 -0.128498 -0.225780 0.275155 -0.242487 -0.190118 -0.123543 -0.142057 -0.181776 0.096606 0.090897 0.094164 0.096853 0.100737 0.089033 0.098986 0.097372 0.121271 0.088822 0.096455 0.095471 0.088667 0.093404 0.094477 0.144265 0.142871 0.136813 0.158441 0.148262 0.146789 0.157466 0.157997 0.160219 0.158321
qa: -0.2838 -0.4439 -0.3276 -0.0832 0.1466 0.0137 -0.1541 -0.2879 -0.2631 -0.2802 0.4315 -0.0272 -0.2511 -0.2270 0.4641 -0.0293 -0.2484 -0.2341 -0.1755 0.2649 -0.1285 -0.2258 0.2752 -0.2425 -0.1901 -0.1235 -0.1421 -0.1818 0.0966 0.0909 0.0942 0.0969 0.1007 0.0890 0.0990 0.0974 0.1213 0.0888 0.0965 0.0955 0.0887 0.0934 0.0945 0.1443 0.1429 0.1368 0.1584 0.1483 0.1468 0.1575 0.1580 0.1602 0.1583
va: 2.1330 2.0697 2.0811 3.1086 3.6857 3.7729 3.9135 3.9097 3.9023 3.8737 4.1509 3.7165 3.9458 3.9265 3.8359 3.6836 4.0582 3.9706 3.9228 3.7499 3.9493 4.0053 3.7000 4.0114 3.9199 3.8844 3.8861 3.9051 1.0268 1.0378 1.0162 1.0011 1.0000 1.0036 1.0027 1.0028 1.0078 1.0087 0.9978 0.9976 1.0082 0.9965 0.9956 0.9930 1.0106 1.0196 0.9901 1.0049 1.0075 0.9970 0.9893 0.9901 0.9905
dispcorr: -0.025311289 hartree
energy: -1210.130535723054
dipole: 32.72585 -30.40908 2.31677 19.64052 -20.66781 -1.02730 8.56266 -9.31442 -0.75176
magnitude: 2.64347 au
magnitude: 6.71916 debye
