program: Orca
programVersion: 5.0.2
elementType: O O O N C C C C C C C C C C C C C C C C C C C C C C C C H H H H H H H H H H H H H H H H H H H H H H H H H
charge: 0
multiplicity: 1
keywords: wb97x-d3
keywords: def2-TZVPP
keywords: def2/J RIJCOSX
keywords: DEFGRID2
keywords: scfconv7
keywords: smallprint printgap noloewdin
keywords: NOSOSCF
formula: C24H25NO3
InChI: InChI=1/C24H25NO3/c1-16(2)13-20-22(24(20,3)4)23(26)28-21(15-25)17-9-8-12-19(14-17)27-18-10-6-5-7-11-18/h5-14,20-22H,1-4H3
53 atoms
O  -0.954945 2.276628 0.042068
O  0.091366 1.912355 -1.893085
O  -0.782765 -3.328445 -1.591327
N  -3.925554 1.577585 1.280628
C  0.713911 4.800434 0.358583
C  1.410553 3.677687 1.043242
C  0.998264 3.521883 -0.417235
C  -0.685895 5.175903 0.782765
C  1.524191 5.993804 -0.091876
C  2.852339 3.725627 1.399742
C  0.022916 2.511948 -0.848242
C  3.674566 2.672932 1.413723
C  3.251993 1.287786 1.034371
C  5.111044 2.810717 1.815583
C  -1.837079 1.202611 -0.245001
C  -1.20428 -0.136491 0.054499
C  -3.001666 1.425458 0.615643
C  -1.285111 -1.15252 -0.88395
C  -0.551953 -0.342312 1.265339
C  -0.705596 -2.385119 -0.61104
C  0.033203 -1.572487 1.51711
C  -0.034376 -2.59882 0.585852
C  -0.871672 -4.654742 -1.255452
C  -1.796347 -5.107349 -0.32191
C  -0.044289 -5.542799 -1.925637
C  -1.879239 -6.466389 -0.057519
C  -0.145937 -6.901525 -1.659032
C  -1.056909 -7.367717 -0.721591
H  0.785983 3.120943 1.737227
H  1.80647 3.60489 -1.134957
H  -1.285335 5.501716 -0.069532
H  -1.21867 4.372246 1.285632
H  -0.634975 6.01252 1.482912
H  1.012133 6.519716 -0.90009
H  1.654428 6.701715 0.729369
H  2.514741 5.719454 -0.455072
H  3.248565 4.693235 1.695684
H  3.429354 0.591987 1.859031
H  2.201126 1.212973 0.759322
H  3.844354 0.920714 0.19154
H  5.77555 2.477871 1.013597
H  5.373209 3.838883 2.065385
H  5.338133 2.18459 2.68258
H  -2.18613 1.236544 -1.28212
H  -1.793364 -0.992361 -1.827447
H  -0.495715 0.444514 2.007247
H  0.553304 -1.739055 2.451253
H  0.436988 -3.550165 0.797453
H  -2.449782 -4.412296 0.191275
H  0.669172 -5.173547 -2.651831
H  -2.598595 -6.821427 0.669322
H  0.498635 -7.59544 -2.183295
H  -1.129453 -8.426719 -0.511617
elementType: O N C H
totalener: -1210.10307800 hartree
nucrepener: 2461.62333664 hartree
electener: -3671.72641464 hartree
oneelecener: -6534.42168654 hartree
twoeener: 2862.69527190 hartree
cpcmener: -0.03091349 hartree
kineticenergy: 1204.70213187 hartree
xcener: -118.581584553291 hartree
chargesum: -0.0000000
charge: -0.272383 -0.446068 -0.326999 -0.087105 0.164572 -0.002532 -0.113349 -0.275558 -0.293086 -0.302601 0.376497 -0.017698 -0.207208 -0.228354 0.380812 0.062853 -0.231765 -0.228235 -0.255591 0.249249 -0.147918 -0.155421 0.252321 -0.172465 -0.229445 -0.149709 -0.130797 -0.173612 0.111649 0.093221 0.102484 0.089239 0.093362 0.098519 0.099080 0.094340 0.121203 0.100642 0.050959 0.099970 0.094459 0.089226 0.095881 0.138319 0.135184 0.154731 0.160101 0.158513 0.158819 0.146838 0.158743 0.157767 0.158346
qa: -0.2724 -0.4461 -0.3270 -0.0871 0.1646 -0.0025 -0.1133 -0.2756 -0.2931 -0.3026 0.3765 -0.0177 -0.2072 -0.2284 0.3808 0.0629 -0.2318 -0.2282 -0.2556 0.2492 -0.1479 -0.1554 0.2523 -0.1725 -0.2294 -0.1497 -0.1308 -0.1736 0.1116 0.0932 0.1025 0.0892 0.0934 0.0985 0.0991 0.0943 0.1212 0.1006 0.0510 0.1000 0.0945 0.0892 0.0959 0.1383 0.1352 0.1547 0.1601 0.1585 0.1588 0.1468 0.1587 0.1578 0.1583
va: 2.1149 2.0651 2.0733 3.1080 3.6839 3.7994 3.8394 3.9012 3.9187 3.8720 4.1727 3.7310 3.9390 3.9304 3.7687 3.5824 4.0675 4.0846 3.9388 3.7745 3.9178 3.9003 3.7112 3.9080 4.0020 3.8944 3.8901 3.8958 1.0141 1.0269 0.9997 1.0109 1.0011 1.0024 0.9994 1.0015 1.0043 1.0004 1.0140 1.0011 0.9968 1.0066 0.9962 1.0190 1.0183 1.0060 0.9916 0.9949 0.9954 1.0069 0.9906 0.9894 0.9901
dispcorr: -0.027052810 hartree
energy: -1210.130130812170
dipole: 23.85030 -22.14255 1.70776 19.74223 -20.14094 -0.39872 9.41783 -8.78167 0.63616
magnitude: 1.86550 au
magnitude: 4.74174 debye
