program: Orca
programVersion: 5.0.2
elementType: O O O N C C C C C C C C C C C C C C C C C C C C C C C C H H H H H H H H H H H H H H H H H H H H H H H H H
charge: 0
multiplicity: 1
keywords: wb97x-d3
keywords: def2-TZVPP
keywords: def2/J RIJCOSX
keywords: DEFGRID2
keywords: scfconv7
keywords: smallprint printgap noloewdin
keywords: NOSOSCF
formula: C24H25NO3
InChI: InChI=1/C24H25NO3/c1-16(2)13-20-22(24(20,3)4)23(26)28-21(15-25)17-9-8-12-19(14-17)27-18-10-6-5-7-11-18/h5-14,20-22H,1-4H3
53 atoms
O  -0.071202 1.287825 0.342717
O  -0.626294 3.210751 -0.642754
O  -1.883607 -3.796184 -1.710618
N  -3.317326 1.798189 1.156127
C  2.525446 3.594002 -0.432032
C  1.794215 4.501772 0.494016
C  1.467139 3.021728 0.507232
C  2.256506 3.689196 -1.913257
C  3.942919 3.191778 -0.106908
C  2.445226 5.145549 1.664671
C  0.166862 2.568754 -0.00058
C  1.828642 5.457789 2.807431
C  0.389455 5.147961 3.080727
C  2.55023 6.159231 3.917137
C  -1.292309 0.722819 -0.107641
C  -1.262268 -0.760987 0.158878
C  -2.422118 1.347166 0.594836
C  -1.536989 -1.629512 -0.886407
C  -0.970261 -1.254219 1.425977
C  -1.534315 -2.999713 -0.661043
C  -0.959319 -2.624558 1.631998
C  -1.243486 -3.505863 0.598229
C  -1.238257 -4.985417 -1.920638
C  -2.015999 -6.068749 -2.302598
C  0.143101 -5.099899 -1.823628
C  -1.402208 -7.278138 -2.596295
C  0.741502 -6.318338 -2.110296
C  -0.024293 -7.410391 -2.49697
H  1.028017 5.10419 0.011065
H  1.858562 2.437246 1.332269
H  2.3754 2.719047 -2.400108
H  1.26135 4.06344 -2.14574
H  2.973067 4.374731 -2.370328
H  4.113456 3.081102 0.964137
H  4.186476 2.238027 -0.578976
H  4.650525 3.933944 -0.482582
H  3.491591 5.415953 1.552099
H  0.294871 4.487671 3.94708
H  -0.159716 6.059535 3.330876
H  -0.119706 4.674094 2.243052
H  3.596574 6.347111 3.675859
H  2.079576 7.119864 4.143105
H  2.51562 5.575267 4.840649
H  -1.437617 0.902479 -1.177002
H  -1.759456 -1.248789 -1.876215
H  -0.758181 -0.582945 2.248553
H  -0.737388 -3.018047 2.615148
H  -1.245946 -4.572916 0.781908
H  -3.091087 -5.962236 -2.376273
H  0.751477 -4.250919 -1.537148
H  -2.009291 -8.121733 -2.898513
H  1.817639 -6.408795 -2.037337
H  0.450546 -8.355939 -2.723379
elementType: O N C H
totalener: -1210.10683576 hartree
nucrepener: 2379.43440192 hartree
electener: -3589.54123768 hartree
oneelecener: -6370.14186177 hartree
twoeener: 2780.60062409 hartree
cpcmener: -0.03139319 hartree
kineticenergy: 1204.70635023 hartree
xcener: -118.581089014383 hartree
chargesum: -0.0000000
charge: -0.283320 -0.450244 -0.327463 -0.092606 0.147694 -0.026450 -0.099880 -0.272028 -0.289005 -0.288281 0.388261 -0.014390 -0.237435 -0.227533 0.424131 0.005000 -0.234806 -0.197309 -0.211789 0.220288 -0.152383 -0.151277 0.262193 -0.238984 -0.173857 -0.125962 -0.151621 -0.179184 0.105958 0.097335 0.100224 0.093647 0.096851 0.093995 0.098813 0.099731 0.122631 0.097792 0.099886 0.078811 0.088925 0.096063 0.093725 0.125219 0.137438 0.150939 0.160930 0.159631 0.146272 0.157563 0.158217 0.159088 0.158557
qa: -0.2833 -0.4502 -0.3275 -0.0926 0.1477 -0.0264 -0.0999 -0.2720 -0.2890 -0.2883 0.3883 -0.0144 -0.2374 -0.2275 0.4241 0.0050 -0.2348 -0.1973 -0.2118 0.2203 -0.1524 -0.1513 0.2622 -0.2390 -0.1739 -0.1260 -0.1516 -0.1792 0.1060 0.0973 0.1002 0.0936 0.0969 0.0940 0.0988 0.0997 0.1226 0.0978 0.0999 0.0788 0.0889 0.0961 0.0937 0.1252 0.1374 0.1509 0.1609 0.1596 0.1463 0.1576 0.1582 0.1591 0.1586
va: 2.1563 2.0519 2.0711 3.1103 3.7124 3.8234 3.8287 3.8913 3.9107 3.8863 4.1488 3.7115 3.9374 3.9304 3.7158 3.7373 4.0149 4.0387 3.9817 3.8151 3.9262 3.9073 3.7052 4.0026 3.9005 3.8896 3.8966 3.8988 1.0258 1.0271 0.9994 1.0150 1.0013 1.0013 1.0031 0.9996 1.0032 0.9988 0.9998 1.0164 1.0065 0.9960 0.9969 1.0254 1.0166 1.0104 0.9911 0.9943 1.0077 0.9965 0.9892 0.9906 0.9902
dispcorr: -0.024262156 hartree
energy: -1210.131097915555
dipole: 25.02965 -22.48884 2.54081 24.55323 -26.07555 -1.52232 9.28302 -9.24390 0.03912
magnitude: 2.96221 au
magnitude: 7.52934 debye
