program: Orca
programVersion: 5.0.2
elementType: O O O N C C C C C C C C C C C C C C C C C C C C C C C C H H H H H H H H H H H H H H H H H H H H H H H H H
charge: 0
multiplicity: 1
keywords: wb97x-d3
keywords: def2-TZVPP
keywords: def2/J RIJCOSX
keywords: DEFGRID2
keywords: scfconv7
keywords: smallprint printgap noloewdin
keywords: NOSOSCF
formula: C24H25NO3
InChI: InChI=1/C24H25NO3/c1-16(2)13-20-22(24(20,3)4)23(26)28-21(15-25)17-9-8-12-19(14-17)27-18-10-6-5-7-11-18/h5-14,20-22H,1-4H3
53 atoms
O  -0.719795 1.600219 0.001052
O  0.401654 0.385699 -1.498667
O  -1.899467 -3.944539 -0.605145
N  -3.831548 2.565903 0.394184
C  1.7282 3.485084 -0.207095
C  1.715656 2.727656 1.087699
C  1.600975 1.968826 -0.218062
C  0.55032 4.364215 -0.551383
C  3.038661 4.030702 -0.721027
C  2.938619 2.53599 1.899791
C  0.397518 1.238222 -0.64553
C  3.139135 2.983339 3.142792
C  2.145803 3.785705 3.924789
C  4.426447 2.706753 3.859295
C  -1.930362 0.943872 -0.366888
C  -2.049145 -0.406321 0.296594
C  -2.993376 1.852465 0.067133
C  -1.960513 -1.548427 -0.483398
C  -2.187471 -0.50489 1.677737
C  -1.98531 -2.795253 0.128014
C  -2.244939 -1.756065 2.268847
C  -2.133348 -2.907059 1.500872
C  -0.906818 -4.069652 -1.540243
C  -1.184401 -4.863368 -2.644987
C  0.342313 -3.47798 -1.389299
C  -0.203371 -5.0646 -3.60488
C  1.30886 -3.680099 -2.364353
C  1.044017 -4.469321 -3.474849
H  0.791181 2.821577 1.647091
H  2.498631 1.453814 -0.543558
H  0.359575 4.365795 -1.626686
H  -0.369694 4.078864 -0.045486
H  0.769272 5.393336 -0.259676
H  3.878535 3.361851 -0.536596
H  2.987501 4.206618 -1.797175
H  3.265313 4.984799 -0.240244
H  3.740857 1.974638 1.429238
H  2.57167 4.754621 4.198663
H  1.217208 3.976609 3.389895
H  1.894692 3.28555 4.863831
H  4.925501 3.636752 4.144341
H  4.250184 2.15509 4.786726
H  5.120615 2.126484 3.251452
H  -2.009641 0.842684 -1.453599
H  -1.859453 -1.466969 -1.558737
H  -2.256432 0.384204 2.292657
H  -2.360657 -1.840487 3.341171
H  -2.159398 -3.884903 1.964944
H  -2.160057 -5.321535 -2.748965
H  0.572116 -2.867236 -0.525494
H  -0.422917 -5.684552 -4.464602
H  2.279675 -3.216204 -2.246291
H  1.803679 -4.621188 -4.230194
elementType: O N C H
totalener: -1210.10467640 hartree
nucrepener: 2482.68524288 hartree
electener: -3692.78991928 hartree
oneelecener: -6576.71730785 hartree
twoeener: 2883.92738857 hartree
cpcmener: -0.03065593 hartree
kineticenergy: 1204.71271142 hartree
xcener: -118.583554916241 hartree
chargesum: 0.0000000
charge: -0.270514 -0.453541 -0.330531 -0.087897 0.127707 0.065958 -0.158944 -0.281283 -0.265774 -0.302049 0.437868 -0.031510 -0.253015 -0.224251 0.381559 0.002300 -0.230497 -0.166227 -0.199119 0.241039 -0.138309 -0.202140 0.287929 -0.250244 -0.185318 -0.120792 -0.150047 -0.187807 0.100968 0.090406 0.102416 0.090843 0.094346 0.088785 0.098970 0.096810 0.118757 0.096069 0.088466 0.096112 0.093577 0.093679 0.088463 0.137476 0.145314 0.145745 0.159544 0.148700 0.145628 0.151609 0.156994 0.158609 0.157160
qa: -0.2705 -0.4535 -0.3305 -0.0879 0.1277 0.0660 -0.1589 -0.2813 -0.2658 -0.3020 0.4379 -0.0315 -0.2530 -0.2243 0.3816 0.0023 -0.2305 -0.1662 -0.1991 0.2410 -0.1383 -0.2021 0.2879 -0.2502 -0.1853 -0.1208 -0.1500 -0.1878 0.1010 0.0904 0.1024 0.0908 0.0943 0.0888 0.0990 0.0968 0.1188 0.0961 0.0885 0.0961 0.0936 0.0937 0.0885 0.1375 0.1453 0.1457 0.1595 0.1487 0.1456 0.1516 0.1570 0.1586 0.1572
va: 2.1291 2.0545 2.0784 3.1062 3.6809 3.7242 3.9349 3.9164 3.9106 3.8660 4.1246 3.7350 3.9461 3.9250 3.7670 3.5995 4.0537 3.9241 3.9725 3.7580 3.9156 4.0181 3.6883 4.0009 3.8757 3.8890 3.9050 3.9073 1.0207 1.0351 0.9993 1.0093 1.0013 1.0048 1.0021 1.0027 1.0091 0.9975 1.0093 0.9972 0.9963 0.9960 1.0086 1.0176 1.0140 1.0071 0.9900 1.0035 1.0082 1.0027 0.9891 0.9912 0.9905
dispcorr: -0.025918999 hartree
energy: -1210.130595397635
dipole: 27.73416 -26.03877 1.69540 23.68215 -23.51317 0.16898 11.90175 -11.39457 0.50718
magnitude: 1.77768 au
magnitude: 4.51852 debye
