program: Orca
programVersion: 5.0.2
elementType: O O O N C C C C C C C C C C C C C C C C C C C C C C C C H H H H H H H H H H H H H H H H H H H H H H H H H
charge: 0
multiplicity: 1
keywords: wb97x-d3
keywords: def2-TZVPP
keywords: def2/J RIJCOSX
keywords: DEFGRID2
keywords: scfconv7
keywords: smallprint printgap noloewdin
keywords: NOSOSCF
formula: C24H25NO3
InChI: InChI=1/C24H25NO3/c1-16(2)13-20-22(24(20,3)4)23(26)28-21(15-25)17-9-8-12-19(14-17)27-18-10-6-5-7-11-18/h5-14,20-22H,1-4H3
53 atoms
O  -0.533771 1.403703 0.09486
O  -1.03247 3.572107 0.264051
O  -0.564194 -3.579013 0.094688
N  -2.711683 1.3507 2.665834
C  1.94101 3.68618 -0.972672
C  1.849119 4.243827 0.406203
C  1.259644 2.879097 0.127607
C  1.120576 4.311633 -2.072694
C  3.258039 3.12496 -1.450259
C  3.035287 4.39412 1.288764
C  -0.199442 2.707081 0.165602
C  3.033594 4.221823 2.613253
C  1.825665 3.802658 3.392938
C  4.268211 4.453599 3.429461
C  -1.911139 1.086003 0.187142
C  -2.122336 -0.336946 -0.267302
C  -2.352942 1.245404 1.579425
C  -1.229755 -1.335514 0.099513
C  -3.231825 -0.63413 -1.046263
C  -1.455833 -2.637199 -0.323045
C  -3.45103 -1.943096 -1.449603
C  -2.570364 -2.950968 -1.093871
C  -0.296421 -4.658784 -0.70817
C  0.091942 -4.492139 -2.031917
C  -0.371554 -5.921517 -0.142118
C  0.401988 -5.61018 -2.791448
C  -0.047638 -7.03147 -0.911061
C  0.334193 -6.881757 -2.23673
H  1.096756 5.02167 0.519526
H  1.820815 2.01697 0.471567
H  0.873466 3.578244 -2.843002
H  0.190838 4.752747 -1.716524
H  1.692989 5.109005 -2.551008
H  3.098603 2.377269 -2.22972
H  3.880654 3.915422 -1.875445
H  3.826182 2.650297 -0.649676
H  3.957973 4.712185 0.810655
H  1.589482 4.543549 4.160465
H  0.936808 3.66871 2.779818
H  2.01343 2.864787 3.920839
H  4.537975 3.560046 3.998542
H  5.123823 4.732677 2.814245
H  4.107855 5.24856 4.162714
H  -2.516358 1.757065 -0.428904
H  -0.36075 -1.120251 0.708981
H  -3.921559 0.148089 -1.336377
H  -4.318116 -2.183141 -2.050487
H  -2.757216 -3.967892 -1.414009
H  0.158648 -3.502262 -2.466386
H  -0.676441 -6.03431 0.890722
H  0.706362 -5.483041 -3.822458
H  -0.104714 -8.017929 -0.469838
H  0.58113 -7.74946 -2.834086
elementType: O N C H
totalener: -1210.10631693 hartree
nucrepener: 2404.88108506 hartree
electener: -3614.98740199 hartree
oneelecener: -6421.16369415 hartree
twoeener: 2806.17629216 hartree
cpcmener: -0.03067058 hartree
kineticenergy: 1204.71386259 hartree
xcener: -118.582632471728 hartree
chargesum: -0.0000000
charge: -0.284266 -0.445979 -0.326412 -0.092066 0.147817 -0.018603 -0.109104 -0.270954 -0.287353 -0.289283 0.384077 -0.018658 -0.234160 -0.228212 0.414723 0.005609 -0.232942 -0.212814 -0.183081 0.214817 -0.147952 -0.157487 0.240884 -0.166529 -0.222665 -0.152177 -0.133015 -0.170055 0.103450 0.101937 0.099324 0.091973 0.097026 0.098871 0.099928 0.094027 0.121591 0.100455 0.078643 0.097699 0.093867 0.089354 0.096166 0.129931 0.135647 0.146210 0.160143 0.157277 0.158866 0.147548 0.159376 0.157787 0.158740
qa: -0.2843 -0.4460 -0.3264 -0.0921 0.1478 -0.0186 -0.1091 -0.2710 -0.2874 -0.2893 0.3841 -0.0187 -0.2342 -0.2282 0.4147 0.0056 -0.2329 -0.2128 -0.1831 0.2148 -0.1480 -0.1575 0.2409 -0.1665 -0.2227 -0.1522 -0.1330 -0.1701 0.1035 0.1019 0.0993 0.0920 0.0970 0.0989 0.0999 0.0940 0.1216 0.1005 0.0786 0.0977 0.0939 0.0894 0.0962 0.1299 0.1356 0.1462 0.1601 0.1573 0.1589 0.1475 0.1594 0.1578 0.1587
va: 2.1484 2.0589 2.0712 3.1097 3.7158 3.8123 3.8183 3.8954 3.9065 3.8851 4.1656 3.7169 3.9357 3.9307 3.7125 3.7590 4.0189 4.0665 3.9569 3.8209 3.9232 3.8864 3.7224 3.9118 3.9992 3.8954 3.8898 3.8931 1.0275 1.0236 1.0000 1.0142 1.0013 1.0033 0.9997 1.0018 1.0040 0.9997 1.0170 0.9993 0.9972 1.0064 0.9960 1.0272 1.0295 1.0022 0.9916 0.9960 0.9950 1.0062 0.9903 0.9895 0.9900
dispcorr: -0.024489277 hartree
energy: -1210.130806207860
dipole: 24.42297 -23.28588 1.13708 20.43671 -21.59383 -1.15712 -0.87576 -1.40513 -2.28089
magnitude: 2.79899 au
magnitude: 7.11447 debye
