program: Orca
programVersion: 5.0.2
elementType: O O O N C C C C C C C C C C C C C C C C C C C C C C C C H H H H H H H H H H H H H H H H H H H H H H H H H
charge: 0
multiplicity: 1
keywords: wb97x-d3
keywords: def2-TZVPP
keywords: def2/J RIJCOSX
keywords: DEFGRID2
keywords: scfconv7
keywords: smallprint printgap noloewdin
keywords: NOSOSCF
formula: C24H25NO3
InChI: InChI=1/C24H25NO3/c1-16(2)13-20-22(24(20,3)4)23(26)28-21(15-25)17-9-8-12-19(14-17)27-18-10-6-5-7-11-18/h5-14,20-22H,1-4H3
53 atoms
O  -0.934887 1.233747 -0.166411
O  -0.935504 3.272952 0.737893
O  -1.744229 -3.785828 -0.469561
N  -2.467187 0.988733 2.858468
C  1.642427 3.647577 -1.038286
C  2.053855 3.312981 0.353093
C  1.034755 2.43322 -0.347329
C  0.814348 4.883281 -1.288572
C  2.577908 3.318332 -2.176339
C  3.400833 2.766861 0.663031
C  -0.349381 2.408805 0.135045
C  3.654029 1.723585 1.45705
C  2.592475 0.939534 2.166213
C  5.055472 1.246009 1.687381
C  -2.277851 1.048212 0.247705
C  -2.755849 -0.271041 -0.305298
C  -2.363846 1.036712 1.715316
C  -1.989945 -1.414378 -0.107695
C  -3.957992 -0.331551 -0.992828
C  -2.430001 -2.6206 -0.631915
C  -4.398676 -1.552686 -1.485969
C  -3.637844 -2.695976 -1.317544
C  -0.377171 -3.771995 -0.365338
C  0.415433 -3.082516 -1.274779
C  0.194912 -4.521504 0.650467
C  1.795123 -3.139621 -1.148587
C  1.577849 -4.580967 0.756228
C  2.382196 -3.88476 -0.134248
H  1.623114 3.959476 1.11498
H  1.397925 1.476164 -0.704145
H  0.125951 4.735431 -2.123118
H  0.234175 5.196253 -0.423461
H  1.472832 5.713278 -1.553082
H  3.147362 2.40548 -1.999851
H  2.019885 3.184823 -3.105046
H  3.291447 4.129767 -2.334918
H  4.241179 3.280451 0.203221
H  1.608013 1.401205 2.124473
H  2.508372 -0.068368 1.749352
H  2.852313 0.814223 3.220299
H  5.325841 1.31089 2.744492
H  5.159115 0.194237 1.40731
H  5.78635 1.818957 1.11683
H  -2.918774 1.85826 -0.113909
H  -1.062461 -1.361942 0.450157
H  -4.546418 0.564324 -1.14396
H  -5.336752 -1.610366 -2.021811
H  -3.973231 -3.645944 -1.714292
H  -0.032927 -2.508792 -2.076088
H  -0.436442 -5.057481 1.347939
H  2.41372 -2.601149 -1.854769
H  2.024724 -5.169711 1.546539
H  3.459543 -3.926956 -0.043861
elementType: O N C H
totalener: -1210.10630937 hartree
nucrepener: 2515.27403644 hartree
electener: -3725.38034582 hartree
oneelecener: -6641.81807938 hartree
twoeener: 2916.43773356 hartree
cpcmener: -0.03150463 hartree
kineticenergy: 1204.72199416 hartree
xcener: -118.585107580170 hartree
chargesum: -0.0000000
charge: -0.284153 -0.448537 -0.326282 -0.090628 0.135344 0.004358 -0.110391 -0.281838 -0.281895 -0.301505 0.384392 -0.012885 -0.232037 -0.227118 0.420108 0.003796 -0.233909 -0.190589 -0.197186 0.239955 -0.115363 -0.228341 0.268815 -0.183693 -0.237850 -0.144639 -0.122187 -0.183323 0.107418 0.097593 0.099881 0.094672 0.095395 0.092788 0.098557 0.099081 0.120850 0.083877 0.098146 0.102542 0.097017 0.093079 0.088895 0.128178 0.147998 0.145798 0.158296 0.147633 0.156850 0.146807 0.159491 0.158325 0.158411
qa: -0.2842 -0.4485 -0.3263 -0.0906 0.1353 0.0044 -0.1104 -0.2818 -0.2819 -0.3015 0.3844 -0.0129 -0.2320 -0.2271 0.4201 0.0038 -0.2339 -0.1906 -0.1972 0.2400 -0.1154 -0.2283 0.2688 -0.1837 -0.2378 -0.1446 -0.1222 -0.1833 0.1074 0.0976 0.0999 0.0947 0.0954 0.0928 0.0986 0.0991 0.1208 0.0839 0.0981 0.1025 0.0970 0.0931 0.0889 0.1282 0.1480 0.1458 0.1583 0.1476 0.1568 0.1468 0.1595 0.1583 0.1584
va: 2.1469 2.0565 2.0816 3.1092 3.7113 3.8005 3.8471 3.8970 3.9078 3.8955 4.1386 3.7138 3.9349 3.9318 3.7506 3.7383 4.0164 3.9329 3.9506 3.7927 3.9093 4.0040 3.7019 3.9172 4.0119 3.8833 3.8814 3.9006 1.0222 1.0230 0.9991 1.0171 1.0010 1.0028 1.0028 1.0006 1.0045 1.0104 0.9989 1.0005 0.9967 0.9970 1.0064 1.0212 1.0160 1.0030 0.9898 1.0056 0.9963 1.0071 0.9903 0.9891 0.9906
dispcorr: -0.026028970 hartree
energy: -1210.132338343010
dipole: 28.80692 -27.63655 1.17037 14.84206 -15.33113 -0.48907 -4.16229 1.82739 -2.33489
magnitude: 2.65720 au
magnitude: 6.75405 debye
