program: Orca
programVersion: 5.0.2
elementType: O O O N C C C C C C C C C C C C C C C C C C C C C C C C H H H H H H H H H H H H H H H H H H H H H H H H H
charge: 0
multiplicity: 1
keywords: wb97x-d3
keywords: def2-TZVPP
keywords: def2/J RIJCOSX
keywords: DEFGRID2
keywords: scfconv7
keywords: smallprint printgap noloewdin
keywords: NOSOSCF
formula: C24H25NO3
InChI: InChI=1/C24H25NO3/c1-16(2)13-20-22(24(20,3)4)23(26)28-21(15-25)17-9-8-12-19(14-17)27-18-10-6-5-7-11-18/h5-14,20-22H,1-4H3
53 atoms
O  -0.940651 1.547162 -0.169085
O  -1.173227 3.740713 0.157841
O  -1.345507 -3.442127 0.298486
N  -3.21667 1.74752 2.335854
C  1.909792 2.184703 0.976713
C  1.881421 1.644167 -0.414453
C  1.014578 2.842555 -0.065372
C  1.304475 1.356638 2.084585
C  3.076971 3.023059 1.437764
C  3.001671 1.782433 -1.37515
C  -0.45524 2.786117 -0.006173
C  2.952314 1.393643 -2.652772
C  1.732695 0.805312 -3.294516
C  4.144195 1.515623 -3.552098
C  -2.341466 1.342744 -0.097872
C  -2.583371 -0.090189 -0.502657
C  -2.819929 1.58817 1.269474
C  -1.875021 -1.096537 0.14444
C  -3.457582 -0.389114 -1.534972
C  -2.019877 -2.408633 -0.277834
C  -3.619705 -1.713928 -1.92244
C  -2.898868 -2.723641 -1.309312
C  -0.136056 -3.198085 0.901779
C  0.903998 -2.593134 0.205835
C  0.030379 -3.611044 2.213667
C  2.117681 -2.391038 0.845294
C  1.255632 -3.415405 2.83765
C  2.298198 -2.798381 2.161643
H  1.328586 0.715159 -0.507595
H  1.363865 3.812231 -0.403002
H  0.871112 1.992121 2.859735
H  0.530516 0.672283 1.740375
H  2.080632 0.749936 2.555647
H  3.466635 3.673467 0.655148
H  2.779658 3.66077 2.272402
H  3.895512 2.38826 1.783888
H  3.92819 2.208898 -1.002769
H  1.522213 1.302423 -4.244817
H  1.887438 -0.251706 -3.5300
H  0.837322 0.881322 -2.67938
H  4.416824 0.544951 -3.975566
H  3.931325 2.171158 -4.400929
H  5.016607 1.91094 -3.031506
H  -2.878609 2.022401 -0.766272
H  -1.208771 -0.853321 0.963748
H  -4.001306 0.399767 -2.038646
H  -4.299482 -1.959199 -2.727581
H  -3.008866 -3.752455 -1.628424
H  0.771196 -2.280963 -0.823034
H  -0.78966 -4.082118 2.741036
H  2.927365 -1.914594 0.307373
H  1.388055 -3.739911 3.861674
H  3.24859 -2.64012 2.654154
elementType: O N C H
totalener: -1210.10393177 hartree
nucrepener: 2597.32402261 hartree
electener: -3807.42795439 hartree
oneelecener: -6805.35294299 hartree
twoeener: 2997.92498861 hartree
cpcmener: -0.03309164 hartree
kineticenergy: 1204.70789509 hartree
xcener: -118.583009309947 hartree
chargesum: -0.0000000
charge: -0.258716 -0.439423 -0.327980 -0.082755 0.200893 -0.021373 -0.093266 -0.269216 -0.303596 -0.287598 0.383607 -0.003800 -0.256775 -0.232894 0.355929 0.005378 -0.219554 -0.209204 -0.196448 0.243764 -0.112008 -0.226675 0.270293 -0.187677 -0.224425 -0.159572 -0.123975 -0.172734 0.078089 0.096232 0.111745 0.059644 0.098062 0.088864 0.101246 0.102602 0.121854 0.097800 0.100556 0.078530 0.093501 0.094571 0.089004 0.131057 0.171079 0.146569 0.158463 0.148124 0.160970 0.146275 0.157588 0.158665 0.158712
qa: -0.2587 -0.4394 -0.3280 -0.0828 0.2009 -0.0214 -0.0933 -0.2692 -0.3036 -0.2876 0.3836 -0.0038 -0.2568 -0.2329 0.3559 0.0054 -0.2196 -0.2092 -0.1964 0.2438 -0.1120 -0.2267 0.2703 -0.1877 -0.2244 -0.1596 -0.1240 -0.1727 0.0781 0.0962 0.1117 0.0596 0.0981 0.0889 0.1012 0.1026 0.1219 0.0978 0.1006 0.0785 0.0935 0.0946 0.0890 0.1311 0.1711 0.1466 0.1585 0.1481 0.1610 0.1463 0.1576 0.1587 0.1587
va: 2.1395 2.0682 2.0882 3.1071 3.7048 3.7814 3.9006 3.9089 3.9194 3.8669 4.1720 3.7099 3.9443 3.9349 3.8201 3.6883 4.0144 3.9172 3.9487 3.8013 3.9035 4.0061 3.6943 3.8936 4.0073 3.8485 3.8771 3.8782 1.0085 1.0271 1.0059 1.0044 1.0020 1.0021 1.0013 0.9986 1.0068 0.9997 0.9969 1.0151 0.9953 0.9962 1.0073 1.0199 0.9842 1.0011 0.9893 1.0056 0.9917 1.0066 0.9912 0.9887 0.9901
dispcorr: -0.029661008 hartree
energy: -1210.133592782930
dipole: 28.40003 -26.69744 1.70260 6.46519 -7.67743 -1.21224 -9.06452 7.21286 -1.85166
magnitude: 2.79231 au
magnitude: 7.09749 debye
