program: Orca
programVersion: 5.0.2
elementType: O O O N C C C C C C C C C C C C C C C C C C C C C C C C H H H H H H H H H H H H H H H H H H H H H H H H H
charge: 0
multiplicity: 1
keywords: wb97x-d3
keywords: def2-TZVPP
keywords: def2/J RIJCOSX
keywords: DEFGRID2
keywords: scfconv7
keywords: smallprint printgap noloewdin
keywords: NOSOSCF
formula: C24H25NO3
InChI: InChI=1/C24H25NO3/c1-16(2)13-20-22(24(20,3)4)23(26)28-21(15-25)17-9-8-12-19(14-17)27-18-10-6-5-7-11-18/h5-14,20-22H,1-4H3
53 atoms
O  -1.092684 1.56596 -0.335822
O  -1.595367 3.736566 -0.210007
O  -1.448663 -3.594392 0.10519
N  -3.021248 1.446856 2.420787
C  1.667765 2.873907 0.583127
C  1.707692 2.031415 -0.661719
C  0.670071 3.115703 -0.538093
C  1.211814 2.23461 1.870872
C  2.714668 3.940666 0.780301
C  2.784406 2.170142 -1.672695
C  -0.770986 2.86845 -0.345733
C  3.799505 1.316164 -1.831227
C  3.999785 0.097816 -0.982593
C  4.83087 1.520695 -2.898637
C  -2.455045 1.219015 -0.12378
C  -2.632985 -0.198934 -0.60059
C  -2.770291 1.356852 1.303365
C  -1.951627 -1.232077 0.034952
C  -3.43089 -0.448761 -1.706381
C  -2.059723 -2.52111 -0.465195
C  -3.544996 -1.748117 -2.183036
C  -2.85783 -2.782889 -1.574935
C  -0.295226 -3.447312 0.831023
C  -0.232906 -4.085065 2.060705
C  0.799163 -2.750444 0.332956
C  0.939892 -4.025527 2.800785
C  1.960562 -2.689992 1.089063
C  2.037187 -3.324035 2.322467
H  1.340178 1.020035 -0.519702
H  0.843948 4.027774 -1.100696
H  2.075014 1.853085 2.420323
H  0.708852 2.958901 2.515142
H  0.53533 1.394508 1.718249
H  2.358695 4.706955 1.471686
H  3.623662 3.508264 1.204308
H  2.988652 4.437112 -0.150308
H  2.731017 3.033486 -2.330179
H  3.293172 0.025098 -0.157418
H  3.914231 -0.813405 -1.581524
H  5.005623 0.089808 -0.55459
H  5.829614 1.623866 -2.465813
H  4.87491 0.6603 -3.572128
H  4.631915 2.407311 -3.500836
H  -3.123675 1.884506 -0.67698
H  -1.345966 -1.029081 0.910334
H  -3.955842 0.361555 -2.195628
H  -4.166005 -1.953844 -3.04467
H  -2.937593 -3.79483 -1.951794
H  -1.093535 -4.627959 2.431133
H  0.75425 -2.264468 -0.634168
H  0.98911 -4.525879 3.759271
H  2.815804 -2.15047 0.702873
H  2.948415 -3.274679 2.903809
elementType: O N C H
totalener: -1210.10475414 hartree
nucrepener: 2545.38272667 hartree
electener: -3755.48748081 hartree
oneelecener: -6701.55918800 hartree
twoeener: 2946.07170719 hartree
cpcmener: -0.03242226 hartree
kineticenergy: 1204.71092788 hartree
xcener: -118.582084151178 hartree
chargesum: -0.0000000
charge: -0.261697 -0.439452 -0.324288 -0.080609 0.149295 0.044269 -0.158239 -0.282966 -0.268574 -0.289133 0.405382 -0.023423 -0.245951 -0.231755 0.378618 0.013427 -0.229366 -0.215683 -0.192240 0.263546 -0.111973 -0.236215 0.302473 -0.250955 -0.231704 -0.107541 -0.118347 -0.207292 0.094972 0.098618 0.097486 0.105863 0.078167 0.099327 0.095702 0.090595 0.119990 0.070875 0.101725 0.097660 0.094793 0.094520 0.089182 0.125253 0.150262 0.145907 0.158944 0.147734 0.146398 0.155817 0.158111 0.176165 0.156326
qa: -0.2617 -0.4395 -0.3243 -0.0806 0.1493 0.0443 -0.1582 -0.2830 -0.2686 -0.2891 0.4054 -0.0234 -0.2460 -0.2318 0.3786 0.0134 -0.2294 -0.2157 -0.1922 0.2635 -0.1120 -0.2362 0.3025 -0.2510 -0.2317 -0.1075 -0.1183 -0.2073 0.0950 0.0986 0.0975 0.1059 0.0782 0.0993 0.0957 0.0906 0.1200 0.0709 0.1017 0.0977 0.0948 0.0945 0.0892 0.1253 0.1503 0.1459 0.1589 0.1477 0.1464 0.1558 0.1581 0.1762 0.1563
va: 2.1609 2.0678 2.0893 3.1045 3.6777 3.7394 3.9438 3.9129 3.9004 3.8679 4.1803 3.7131 3.9387 3.9286 3.7740 3.7191 4.0303 3.9516 3.9417 3.7828 3.9029 4.0076 3.6852 4.0229 3.9405 3.8741 3.8240 3.9536 1.0098 1.0308 1.0025 1.0024 1.0108 1.0029 1.0024 1.0028 1.0083 1.0092 0.9956 0.9990 0.9961 0.9950 1.0080 1.0273 1.0040 1.0010 0.9894 1.0063 1.0078 0.9984 0.9888 0.9784 0.9939
dispcorr: -0.027806131 hartree
energy: -1210.132560267165
dipole: 33.29969 -31.53667 1.76302 8.80787 -9.86216 -1.05429 -4.34001 2.73631 -1.60370
magnitude: 2.60607 au
magnitude: 6.62411 debye
