program: Orca
programVersion: 5.0.2
elementType: O O O N C C C C C C C C C C C C C C C C C C C C C C C C H H H H H H H H H H H H H H H H H H H H H H H H H
charge: 0
multiplicity: 1
keywords: wb97x-d3
keywords: def2-TZVPP
keywords: def2/J RIJCOSX
keywords: DEFGRID2
keywords: scfconv7
keywords: smallprint printgap noloewdin
keywords: NOSOSCF
formula: C24H25NO3
InChI: InChI=1/C24H25NO3/c1-16(2)13-20-22(24(20,3)4)23(26)28-21(15-25)17-9-8-12-19(14-17)27-18-10-6-5-7-11-18/h5-14,20-22H,1-4H3
53 atoms
O  -1.243706 1.412788 0.629972
O  -0.094032 1.837558 -1.250285
O  -1.591481 -3.579477 0.080617
N  -4.1331 2.990674 0.897566
C  2.198556 0.784208 0.702695
C  2.37801 2.235828 0.372135
C  1.031484 1.749257 0.86372
C  2.200986 -0.21729 -0.42568
C  2.773258 0.226662 1.981971
C  3.157685 3.155547 1.224458
C  -0.113668 1.693689 -0.056081
C  4.044544 4.067694 0.812666
C  4.42101 4.318204 -0.615737
C  4.749792 4.94745 1.801405
C  -2.453189 1.248927 -0.088512
C  -2.949584 -0.180329 0.011502
C  -3.400816 2.215875 0.471959
C  -2.018256 -1.211497 0.018712
C  -4.308511 -0.467416 0.024623
C  -2.457659 -2.528192 0.028677
C  -4.730153 -1.789048 0.048767
C  -3.813201 -2.826044 0.044931
C  -0.396971 -3.532744 -0.588446
C  -0.301082 -3.067843 -1.894748
C  0.716104 -4.037313 0.068179
C  0.927511 -3.107977 -2.537963
C  1.935513 -4.083986 -0.592894
C  2.048475 -3.615574 -1.894351
H  2.409684 2.440866 -0.692386
H  0.770829 1.977064 1.891673
H  3.211675 -0.60468 -0.568669
H  1.555806 -1.067601 -0.193099
H  1.879865 0.202248 -1.377151
H  3.833542 -0.002289 1.855573
H  2.680152 0.908474 2.826233
H  2.265471 -0.70102 2.253012
H  2.977246 3.081069 2.292997
H  3.95834 3.633465 -1.323352
H  4.150009 5.33475 -0.913085
H  5.503465 4.240823 -0.744631
H  5.833687 4.815879 1.742969
H  4.557023 6.003589 1.593534
H  4.441588 4.746823 2.827614
H  -2.315818 1.509197 -1.143898
H  -0.955335 -1.006351 0.021195
H  -5.047134 0.324124 0.01797
H  -5.788633 -2.01242 0.064374
H  -4.141816 -3.857435 0.059173
H  -1.171195 -2.683716 -2.412744
H  0.624605 -4.399005 1.084786
H  1.003189 -2.744755 -3.554821
H  2.802018 -4.482256 -0.080889
H  3.002033 -3.646226 -2.404849
elementType: O N C H
totalener: -1210.10646933 hartree
nucrepener: 2521.18440556 hartree
electener: -3731.29087488 hartree
oneelecener: -6653.19671882 hartree
twoeener: 2921.90584394 hartree
cpcmener: -0.02916609 hartree
kineticenergy: 1204.68989159 hartree
xcener: -118.583684626861 hartree
chargesum: -0.0000000
charge: -0.283335 -0.435287 -0.325777 -0.088087 0.139477 0.035066 -0.101177 -0.258052 -0.277309 -0.278548 0.376379 -0.046879 -0.252078 -0.217982 0.414598 -0.021304 -0.215790 -0.171869 -0.213502 0.256173 -0.109040 -0.236959 0.258623 -0.176426 -0.213757 -0.145514 -0.131377 -0.183857 0.093807 0.092695 0.108604 0.035530 0.101739 0.099589 0.090776 0.098108 0.116444 0.089930 0.097249 0.093946 0.093043 0.092710 0.087605 0.135704 0.161381 0.138000 0.158813 0.146381 0.156140 0.145019 0.158234 0.156039 0.156105
qa: -0.2833 -0.4353 -0.3258 -0.0881 0.1395 0.0351 -0.1012 -0.2581 -0.2773 -0.2785 0.3764 -0.0469 -0.2521 -0.2180 0.4146 -0.0213 -0.2158 -0.1719 -0.2135 0.2562 -0.1090 -0.2370 0.2586 -0.1764 -0.2138 -0.1455 -0.1314 -0.1839 0.0938 0.0927 0.1086 0.0355 0.1017 0.0996 0.0908 0.0981 0.1164 0.0899 0.0972 0.0939 0.0930 0.0927 0.0876 0.1357 0.1614 0.1380 0.1588 0.1464 0.1561 0.1450 0.1582 0.1560 0.1561
va: 2.1140 2.0815 2.0855 3.1062 3.6787 3.8041 3.8205 3.8973 3.9089 3.8836 4.2209 3.7637 3.9415 3.9219 3.7234 3.7893 4.0549 3.9367 3.9667 3.7645 3.9234 4.0135 3.7037 3.8934 3.9524 3.8554 3.8631 3.8610 1.0319 1.0360 1.0016 1.0204 1.0169 1.0014 1.0067 1.0011 1.0114 1.0102 0.9964 0.9978 0.9966 0.9961 1.0091 1.0286 0.9677 1.0135 0.9897 1.0067 0.9962 1.0075 0.9913 0.9902 0.9919
dispcorr: -0.027754639 hartree
energy: -1210.134223965445
dipole: 35.53931 -33.81771 1.72160 11.25313 -12.45225 -1.19912 2.64596 -2.89735 -0.25139
magnitude: 2.11305 au
magnitude: 5.37095 debye
