program: Orca
programVersion: 5.0.2
elementType: O O O N C C C C C C C C C C C C C C C C C C C C C C C C H H H H H H H H H H H H H H H H H H H H H H H H H
charge: 0
multiplicity: 1
keywords: wb97x-d3
keywords: def2-TZVPP
keywords: def2/J RIJCOSX
keywords: DEFGRID2
keywords: scfconv7
keywords: smallprint printgap noloewdin
keywords: NOSOSCF
formula: C24H25NO3
InChI: InChI=1/C24H25NO3/c1-16(2)13-20-22(24(20,3)4)23(26)28-21(15-25)17-9-8-12-19(14-17)27-18-10-6-5-7-11-18/h5-14,20-22H,1-4H3
53 atoms
O  -0.313528 1.265997 1.288388
O  -0.867817 2.636983 -0.3854
O  0.025283 -3.107204 -1.272008
N  -1.963784 -0.518406 3.52217
C  2.246166 2.84016 -0.734279
C  1.773119 4.03163 0.024801
C  1.363234 2.650041 0.49454
C  1.703148 2.585792 -2.118897
C  3.673091 2.377856 -0.561075
C  2.697862 4.852101 0.849756
C  -0.035966 2.224315 0.382325
C  2.475323 5.269003 2.098771
C  1.232365 4.957253 2.874506
C  3.489487 6.091517 2.833728
C  -1.618329 0.710293 1.242378
C  -1.778557 -0.282867 0.114885
C  -1.796119 0.034731 2.529696
C  -0.813415 -1.267535 -0.066656
C  -2.891703 -0.229261 -0.708978
C  -0.972068 -2.19162 -1.084277
C  -3.041347 -1.170368 -1.719867
C  -2.085934 -2.15308 -1.916481
C  -0.281913 -4.439491 -1.316953
C  0.523687 -5.240755 -2.115205
C  -1.311728 -4.994607 -0.566726
C  0.297846 -6.608428 -2.157583
C  -1.530368 -6.364009 -0.627097
C  -0.731989 -7.176711 -1.419742
H  0.974019 4.584159 -0.465726
H  1.877662 2.270855 1.370082
H  1.62355 1.516222 -2.323977
H  0.727486 3.035121 -2.28971
H  2.38685 3.009382 -2.857525
H  3.761513 1.315457 -0.796208
H  4.338482 2.919779 -1.236633
H  4.040384 2.522997 0.454945
H  3.627808 5.144464 0.368633
H  0.822797 5.866899 3.320502
H  0.447434 4.50296 2.273224
H  1.452546 4.281287 3.705695
H  3.793008 5.598325 3.761242
H  4.385686 6.270887 2.239621
H  3.075408 7.061138 3.122142
H  -2.384061 1.490142 1.17219
H  0.057974 -1.325029 0.575402
H  -3.638534 0.54144 -0.566614
H  -3.90645 -1.130345 -2.368293
H  -2.202979 -2.876737 -2.713723
H  1.323371 -4.794924 -2.693552
H  -1.935466 -4.37767 0.068109
H  0.928384 -7.230571 -2.779771
H  -2.331416 -6.79556 -0.040684
H  -0.908695 -8.243437 -1.459527
elementType: O N C H
totalener: -1210.10594344 hartree
nucrepener: 2440.31832896 hartree
electener: -3650.42427240 hartree
oneelecener: -6492.10966702 hartree
twoeener: 2841.68539462 hartree
cpcmener: -0.02963675 hartree
kineticenergy: 1204.71199253 hartree
xcener: -118.582433243600 hartree
chargesum: -0.0000000
charge: -0.290775 -0.448570 -0.329251 -0.089361 0.137581 0.006683 -0.119337 -0.282426 -0.281370 -0.300484 0.376562 -0.014625 -0.237208 -0.226899 0.425379 0.008443 -0.230567 -0.208375 -0.181911 0.187735 -0.133590 -0.152081 0.260962 -0.237365 -0.165212 -0.127630 -0.161062 -0.180438 0.105911 0.101236 0.099735 0.094506 0.095948 0.098771 0.098891 0.093014 0.120998 0.101510 0.085585 0.101458 0.093934 0.088866 0.096302 0.140520 0.136993 0.146167 0.160590 0.160940 0.146043 0.153918 0.156268 0.159212 0.157875
qa: -0.2908 -0.4486 -0.3293 -0.0894 0.1376 0.0067 -0.1193 -0.2824 -0.2814 -0.3005 0.3766 -0.0146 -0.2372 -0.2269 0.4254 0.0084 -0.2306 -0.2084 -0.1819 0.1877 -0.1336 -0.1521 0.2610 -0.2374 -0.1652 -0.1276 -0.1611 -0.1804 0.1059 0.1012 0.0997 0.0945 0.0959 0.0988 0.0989 0.0930 0.1210 0.1015 0.0856 0.1015 0.0939 0.0889 0.0963 0.1405 0.1370 0.1462 0.1606 0.1609 0.1460 0.1539 0.1563 0.1592 0.1579
va: 2.1082 2.0641 2.0645 3.1119 3.7112 3.7992 3.8340 3.8978 3.9062 3.8929 4.1534 3.7183 3.9301 3.9311 3.7037 3.6117 4.0850 4.0455 3.9729 3.8306 3.9005 3.9318 3.7078 3.9907 3.8708 3.8992 3.9057 3.8960 1.0222 1.0264 0.9989 1.0176 1.0013 1.0030 1.0007 1.0030 1.0046 1.0001 1.0103 0.9985 0.9967 1.0065 0.9967 1.0183 1.0267 1.0030 0.9904 0.9926 1.0080 0.9994 0.9896 0.9907 0.9903
dispcorr: -0.025485825 hartree
energy: -1210.131429263174
dipole: 20.45390 -19.98680 0.46710 24.30809 -23.92855 0.37954 -0.08675 -1.02839 -1.11514
magnitude: 1.26719 au
magnitude: 3.22093 debye
