program: Orca
programVersion: 5.0.2
elementType: O O O N C C C C C C C C C C C C C C C C C C C C C C C C H H H H H H H H H H H H H H H H H H H H H H H H H
charge: 0
multiplicity: 1
keywords: wb97x-d3
keywords: def2-TZVPP
keywords: def2/J RIJCOSX
keywords: DEFGRID2
keywords: scfconv7
keywords: smallprint printgap noloewdin
keywords: NOSOSCF
formula: C24H25NO3
InChI: InChI=1/C24H25NO3/c1-16(2)13-20-22(24(20,3)4)23(26)28-21(15-25)17-9-8-12-19(14-17)27-18-10-6-5-7-11-18/h5-14,20-22H,1-4H3
53 atoms
O  -1.15233 1.826575 0.204909
O  -1.287488 1.778281 -2.019831
O  -1.304334 -3.266163 0.336905
N  -3.211476 1.886713 2.771014
C  1.455351 3.390518 -0.265782
C  1.725852 1.978439 0.153744
C  0.812419 2.244738 -1.03272
C  0.639203 4.271764 0.64942
C  2.506114 4.165625 -1.025058
C  3.022273 1.31072 -0.068435
C  -0.6249 1.936155 -1.025288
C  3.633105 0.46638 0.770262
C  3.083815 0.014602 2.088822
C  4.971669 -0.116288 0.428818
C  -2.52585 1.484141 0.281651
C  -2.784719 0.0438 -0.099252
C  -2.895278 1.715578 1.68025
C  -1.902171 -0.943351 0.316362
C  -3.902299 -0.27836 -0.856378
C  -2.134697 -2.257685 -0.061757
C  -4.137592 -1.601763 -1.197665
C  -3.250269 -2.595573 -0.814356
C  0.044294 -3.166539 0.135208
C  0.601645 -2.440641 -0.911423
C  0.853362 -3.885104 1.006361
C  1.98041 -2.43967 -1.074998
C  2.227366 -3.884752 0.821021
C  2.798689 -3.163512 -0.219118
H  1.203899 1.684314 1.056644
H  1.241457 2.069633 -2.013291
H  1.3121 4.869797 1.267133
H  0.017488 4.965783 0.079832
H  -0.005937 3.718047 1.327731
H  3.252217 4.570759 -0.33822
H  3.029316 3.566325 -1.768926
H  2.049884 5.007359 -1.549688
H  3.524088 1.538841 -1.004277
H  2.189607 0.547773 2.407032
H  2.836362 -1.051226 2.051539
H  3.832789 0.128084 2.877234
H  5.734975 0.224243 1.134261
H  4.957321 -1.20703 0.49719
H  5.299999 0.154715 -0.574846
H  -3.137502 2.150969 -0.335267
H  -1.036302 -0.698229 0.920633
H  -4.581953 0.498971 -1.182086
H  -5.00658 -1.860397 -1.788174
H  -3.419031 -3.626987 -1.097127
H  -0.019768 -1.884151 -1.601733
H  0.406142 -4.445657 1.817929
H  2.412969 -1.873465 -1.889851
H  2.853772 -4.450098 1.499132
H  3.871101 -3.166768 -0.361318
elementType: O N C H
totalener: -1210.10461749 hartree
nucrepener: 2605.42672634 hartree
electener: -3815.53134383 hartree
oneelecener: -6821.97096091 hartree
twoeener: 3006.43961708 hartree
cpcmener: -0.03204530 hartree
kineticenergy: 1204.71034854 hartree
xcener: -118.586844283109 hartree
chargesum: -0.0000000
charge: -0.279356 -0.440880 -0.327952 -0.086699 0.096765 0.083425 -0.097161 -0.269976 -0.278482 -0.302635 0.394864 -0.060177 -0.249575 -0.222432 0.376680 0.038959 -0.229712 -0.182544 -0.203111 0.218917 -0.117261 -0.214129 0.298752 -0.183815 -0.244648 -0.151111 -0.118065 -0.214699 0.102337 0.090108 0.095622 0.100682 0.090620 0.098418 0.089538 0.097928 0.116385 0.092864 0.087885 0.100842 0.103193 0.087312 0.090193 0.143226 0.152319 0.144639 0.159455 0.148454 0.150026 0.145437 0.158324 0.154937 0.165315
qa: -0.2794 -0.4409 -0.3280 -0.0867 0.0968 0.0834 -0.0972 -0.2700 -0.2785 -0.3026 0.3949 -0.0602 -0.2496 -0.2224 0.3767 0.0390 -0.2297 -0.1825 -0.2031 0.2189 -0.1173 -0.2141 0.2988 -0.1838 -0.2446 -0.1511 -0.1181 -0.2147 0.1023 0.0901 0.0956 0.1007 0.0906 0.0984 0.0895 0.0979 0.1164 0.0929 0.0879 0.1008 0.1032 0.0873 0.0902 0.1432 0.1523 0.1446 0.1595 0.1485 0.1500 0.1454 0.1583 0.1549 0.1653
va: 2.1115 2.0672 2.0823 3.1082 3.7220 3.7005 3.8506 3.9128 3.9196 3.8493 4.1601 3.7655 3.9327 3.9138 3.7602 3.5741 4.0734 3.9528 3.9867 3.7787 3.8919 4.0092 3.6863 3.8651 4.0004 3.8409 3.8672 3.8617 1.0178 1.0310 1.0002 0.9999 1.0103 1.0009 1.0075 1.0010 1.0130 1.0108 1.0004 1.0001 0.9973 0.9979 1.0085 1.0158 1.0078 1.0024 0.9890 1.0034 1.0045 1.0082 0.9939 0.9911 0.9840
dispcorr: -0.030157894 hartree
energy: -1210.134775381150
dipole: 30.55134 -29.18227 1.36907 10.84553 -10.74491 0.10062 0.53746 -1.41672 -0.87926
magnitude: 1.63021 au
magnitude: 4.14366 debye
