program: Orca
programVersion: 5.0.2
elementType: O O O N C C C C C C C C C C C C C C C C C C C C C C C C H H H H H H H H H H H H H H H H H H H H H H H H H
charge: 0
multiplicity: 1
keywords: wb97x-d3
keywords: def2-TZVPP
keywords: def2/J RIJCOSX
keywords: DEFGRID2
keywords: scfconv7
keywords: smallprint printgap noloewdin
keywords: NOSOSCF
formula: C24H25NO3
InChI: InChI=1/C24H25NO3/c1-16(2)13-20-22(24(20,3)4)23(26)28-21(15-25)17-9-8-12-19(14-17)27-18-10-6-5-7-11-18/h5-14,20-22H,1-4H3
53 atoms
O  -0.761761 1.747684 0.958268
O  0.680327 1.744531 -0.746704
O  -1.086431 -3.448554 -1.926923
N  -3.94712 0.974639 1.354363
C  2.659072 2.813968 1.452364
C  2.170777 3.970454 0.637663
C  1.16435 3.001604 1.238777
C  3.40155 1.704528 0.747994
C  3.147795 3.040501 2.862786
C  2.186262 5.363319 1.12519
C  0.387187 2.11992 0.359212
C  2.559612 6.446798 0.435499
C  3.053049 6.438923 -0.979143
C  2.502515 7.807326 1.063873
C  -1.588302 0.851963 0.236597
C  -1.084747 -0.573983 0.27424
C  -2.902457 0.93421 0.879445
C  -1.293876 -1.383047 -0.832601
C  -0.473748 -1.080731 1.41412
C  -0.887232 -2.709012 -0.798298
C  -0.05577 -2.402967 1.425393
C  -0.257619 -3.225176 0.327438
C  -1.44138 -4.767715 -1.808867
C  -2.45991 -5.170583 -0.953804
C  -0.784031 -5.685998 -2.613295
C  -2.811254 -6.511256 -0.904785
C  -1.153506 -7.023292 -2.561354
C  -2.160783 -7.442564 -1.703831
H  2.314191 3.843693 -0.430003
H  0.623317 3.355533 2.109222
H  3.158504 1.624406 -0.309119
H  4.47559 1.887808 0.819372
H  3.203652 0.737565 1.215228
H  2.555637 3.7735 3.40901
H  3.116077 2.107952 3.429408
H  4.182945 3.388125 2.856184
H  1.846995 5.513032 2.146142
H  4.022828 6.938443 -1.047587
H  3.167333 5.443745 -1.404451
H  2.373699 7.000324 -1.626486
H  1.862001 8.479836 0.486659
H  2.120911 7.775819 2.084523
H  3.492303 8.27121 1.088631
H  -1.717149 1.177001 -0.801543
H  -1.771991 -0.988562 -1.721633
H  -0.318492 -0.459871 2.286816
H  0.434685 -2.803302 2.302919
H  0.079172 -4.253782 0.352686
H  -2.97999 -4.449717 -0.334944
H  0.006261 -5.356301 -3.276132
H  -3.604595 -6.826395 -0.239305
H  -0.641788 -7.74027 -3.190453
H  -2.441185 -8.486743 -1.660686
elementType: O N C H
totalener: -1210.10737585 hartree
nucrepener: 2385.41814834 hartree
electener: -3595.52552419 hartree
oneelecener: -6382.26207306 hartree
twoeener: 2786.73654888 hartree
cpcmener: -0.03113898 hartree
kineticenergy: 1204.70739929 hartree
xcener: -118.582825157488 hartree
chargesum: 0.0000000
charge: -0.288432 -0.445828 -0.328790 -0.088221 0.101581 0.044079 -0.088752 -0.271709 -0.268313 -0.275432 0.375894 -0.047708 -0.252452 -0.216564 0.403068 0.031739 -0.227684 -0.228132 -0.209941 0.232647 -0.147883 -0.152269 0.246636 -0.163959 -0.229310 -0.153413 -0.131092 -0.174020 0.094665 0.091255 0.093902 0.097331 0.096570 0.088012 0.097699 0.098070 0.116927 0.094366 0.090110 0.097529 0.092779 0.087642 0.093453 0.142643 0.134652 0.147453 0.159598 0.158611 0.158431 0.147070 0.159337 0.157884 0.158271
qa: -0.2884 -0.4458 -0.3288 -0.0882 0.1016 0.0441 -0.0888 -0.2717 -0.2683 -0.2754 0.3759 -0.0477 -0.2525 -0.2166 0.4031 0.0317 -0.2277 -0.2281 -0.2099 0.2326 -0.1479 -0.1523 0.2466 -0.1640 -0.2293 -0.1534 -0.1311 -0.1740 0.0947 0.0913 0.0939 0.0973 0.0966 0.0880 0.0977 0.0981 0.1169 0.0944 0.0901 0.0975 0.0928 0.0876 0.0935 0.1426 0.1347 0.1475 0.1596 0.1586 0.1584 0.1471 0.1593 0.1579 0.1583
va: 2.1131 2.0657 2.0687 3.1146 3.6969 3.7902 3.8352 3.9032 3.9113 3.8824 4.1866 3.7663 3.9419 3.9210 3.7165 3.6368 4.0748 4.0901 3.9545 3.7844 3.9242 3.8966 3.7170 3.8981 3.9981 3.8968 3.8906 3.8953 1.0295 1.0362 1.0179 1.0006 1.0006 1.0064 1.0017 1.0017 1.0114 0.9977 1.0103 0.9963 0.9960 1.0091 0.9966 1.0200 1.0174 1.0132 0.9912 0.9948 0.9957 1.0067 0.9904 0.9892 0.9901
dispcorr: -0.024254844 hartree
energy: -1210.131630692464
dipole: 27.54418 -25.73148 1.81271 27.93755 -28.13450 -0.19694 6.99361 -6.54128 0.45233
magnitude: 1.87864 au
magnitude: 4.77513 debye
