program: Orca
programVersion: 5.0.2
elementType: O O O N C C C C C C C C C C C C C C C C C C C C C C C C H H H H H H H H H H H H H H H H H H H H H H H H H
charge: 0
multiplicity: 1
keywords: wb97x-d3
keywords: def2-TZVPP
keywords: def2/J RIJCOSX
keywords: DEFGRID2
keywords: scfconv7
keywords: smallprint printgap noloewdin
keywords: NOSOSCF
formula: C24H25NO3
InChI: InChI=1/C24H25NO3/c1-16(2)13-20-22(24(20,3)4)23(26)28-21(15-25)17-9-8-12-19(14-17)27-18-10-6-5-7-11-18/h5-14,20-22H,1-4H3
53 atoms
O  -0.972431 2.101141 0.249715
O  0.756806 1.228511 -0.863143
O  -1.671743 -3.536216 -1.333861
N  -4.259226 2.101573 -0.024209
C  2.297086 2.420816 1.644606
C  2.550639 3.253231 0.436309
C  1.121455 2.913442 0.80465
C  2.692156 0.965426 1.621489
C  2.403743 3.047743 3.013468
C  3.017976 4.661743 0.52224
C  0.34126 1.995369 -0.031866
C  2.640392 5.640566 -0.303681
C  1.664553 5.440775 -1.422271
C  3.167408 7.035035 -0.156566
C  -1.837145 1.206688 -0.430316
C  -1.726333 -0.212445 0.07941
C  -3.187706 1.723234 -0.192044
C  -1.693051 -1.253111 -0.834217
C  -1.668043 -0.46908 1.44421
C  -1.624478 -2.563807 -0.38132
C  -1.583666 -1.782043 1.880716
C  -1.568606 -2.836996 0.979403
C  -0.973279 -4.704214 -1.189315
C  -1.603965 -5.866023 -1.61113
C  0.331948 -4.73707 -0.713828
C  -0.919884 -7.071752 -1.5607
C  0.999271 -5.952533 -0.6583
C  0.381018 -7.122357 -1.079455
H  2.923348 2.693042 -0.418844
H  0.539579 3.704961 1.263096
H  2.030441 0.365824 2.2502
H  2.688247 0.53513 0.621978
H  3.705429 0.857237 2.014454
H  3.436079 3.026395 3.369301
H  2.067995 4.084783 3.027243
H  1.79647 2.495971 3.733582
H  3.735307 4.891597 1.3054
H  2.054013 5.860572 -2.352993
H  1.424773 4.394824 -1.605568
H  0.727849 5.966801 -1.216531
H  2.35029 7.750897 -0.033031
H  3.835762 7.136117 0.698484
H  3.714363 7.344762 -1.051067
H  -1.665457 1.233221 -1.511917
H  -1.725152 -1.052761 -1.898638
H  -1.691995 0.338949 2.164485
H  -1.54112 -1.993013 2.941153
H  -1.520675 -3.855697 1.342383
H  -2.619797 -5.822136 -1.983562
H  0.83224 -3.830328 -0.396856
H  -1.412658 -7.975493 -1.895438
H  2.016434 -5.979617 -0.289056
H  0.910986 -8.0647 -1.036493
elementType: O N C H
totalener: -1210.10588077 hartree
nucrepener: 2432.50419294 hartree
electener: -3642.61007371 hartree
oneelecener: -6476.35767820 hartree
twoeener: 2833.74760449 hartree
cpcmener: -0.03003694 hartree
kineticenergy: 1204.71136482 hartree
xcener: -118.582978696502 hartree
chargesum: -0.0000000
charge: -0.283854 -0.446251 -0.325336 -0.089343 0.150757 -0.010682 -0.104701 -0.275556 -0.284785 -0.298398 0.366679 -0.008798 -0.242461 -0.227213 0.405001 0.033231 -0.226319 -0.232520 -0.229515 0.266136 -0.134917 -0.178532 0.285479 -0.249070 -0.194988 -0.121769 -0.145045 -0.183110 0.105880 0.096701 0.095171 0.094250 0.098360 0.099470 0.093551 0.098285 0.121447 0.100250 0.080603 0.101572 0.093817 0.089146 0.096368 0.140506 0.134391 0.147792 0.160205 0.158511 0.145734 0.158904 0.157699 0.159321 0.157945
qa: -0.2839 -0.4463 -0.3253 -0.0893 0.1508 -0.0107 -0.1047 -0.2756 -0.2848 -0.2984 0.3667 -0.0088 -0.2425 -0.2272 0.4050 0.0332 -0.2263 -0.2325 -0.2295 0.2661 -0.1349 -0.1785 0.2855 -0.2491 -0.1950 -0.1218 -0.1450 -0.1831 0.1059 0.0967 0.0952 0.0943 0.0984 0.0995 0.0936 0.0983 0.1214 0.1003 0.0806 0.1016 0.0938 0.0891 0.0964 0.1405 0.1344 0.1478 0.1602 0.1585 0.1457 0.1589 0.1577 0.1593 0.1579
va: 2.1139 2.0624 2.0797 3.1132 3.7127 3.8207 3.8109 3.8933 3.9062 3.8957 4.1786 3.7042 3.9368 3.9321 3.7216 3.6056 4.0791 4.0863 3.9632 3.7687 3.9116 3.9201 3.6878 4.0084 3.9133 3.8859 3.8918 3.9048 1.0238 1.0303 1.0010 1.0161 1.0019 0.9999 1.0020 1.0030 1.0037 1.0004 1.0146 0.9978 0.9962 1.0063 0.9965 1.0183 1.0187 1.0128 0.9905 0.9946 1.0084 0.9967 0.9892 0.9904 0.9905
dispcorr: -0.025540784 hartree
energy: -1210.131421552073
dipole: 26.68495 -24.78275 1.90220 22.67698 -22.99878 -0.32180 8.45517 -7.59795 0.85722
magnitude: 2.11110 au
magnitude: 5.36599 debye
