program: Orca
elementType: O O O N C C C C C C C C C C C C C C C C C C C C C C C C H H H H H H H H H H H H H H H H H H H H H H H H H
charge: 0
multiplicity: 1
keywords: wb97x-d3
keywords: def2-TZVPP
keywords: def2/J RIJCOSX
keywords: DEFGRID2
keywords: scfconv7
keywords: smallprint printgap noloewdin
keywords: NOSOSCF
formula: C24H25NO3
InChI: InChI=1/C24H25NO3/c1-16(2)13-20-22(24(20,3)4)23(26)28-21(15-25)17-9-8-12-19(14-17)27-18-10-6-5-7-11-18/h5-14,20-22H,1-4H3
53 atoms
O  -1.057102 1.987229 0.587696
O  -1.751855 2.972389 -1.290291
O  -0.041059 -2.907085 -0.705263
N  -2.58972 0.59946 3.154811
C  1.517352 3.590052 0.41937
C  1.703301 2.333854 -0.357358
C  0.506518 3.243454 -0.659949
C  1.17847 3.504051 1.888964
C  2.374927 4.791519 0.093956
C  2.752973 2.13942 -1.385002
C  -0.866156 2.750841 -0.501085
C  2.7666 1.128187 -2.25892
C  1.694762 0.080646 -2.314923
C  3.878346 0.963229 -3.248049
C  -2.270309 1.245239 0.643538
C  -2.180728 0.023972 -0.239693
C  -2.436096 0.885774 2.053296
C  -1.178517 -0.909758 -0.001729
C  -3.03282 -0.11607 -1.325954
C  -1.042222 -1.991776 -0.85817
C  -2.879452 -1.201508 -2.17709
C  -1.88873 -2.142722 -1.948585
C  0.252284 -3.388554 0.543401
C  -0.742451 -3.724797 1.453709
C  1.59095 -3.585312 0.850596
C  -0.382276 -4.257465 2.682829
C  1.935183 -4.12835 2.080355
C  0.953379 -4.462678 3.002438
H  1.428972 1.433864 0.185234
H  0.599403 3.834553 -1.563696
H  0.50038 4.305692 2.187635
H  0.731379 2.556061 2.177429
H  2.093705 3.617529 2.473595
H  3.340734 4.723292 0.598744
H  2.564166 4.90334 -0.9736
H  1.88877 5.707247 0.435735
H  3.566227 2.858705 -1.410828
H  0.768761 0.391694 -1.833028
H  1.458101 -0.178761 -3.349106
H  2.024342 -0.843797 -1.831924
H  4.648304 1.726881 -3.136814
H  4.356237 -0.014786 -3.143673
H  3.499678 1.012117 -4.272579
H  -3.130849 1.860363 0.363715
H  -0.501715 -0.789717 0.837086
H  -3.805538 0.618344 -1.51249
H  -3.537698 -1.31673 -3.027938
H  -1.767177 -2.98984 -2.611772
H  -1.788322 -3.581345 1.212148
H  2.355763 -3.320364 0.131341
H  -1.156932 -4.520299 3.39155
H  2.979755 -4.283018 2.318312
H  1.225736 -4.88157 3.962184
elementType: O N C H
totalener: -1210.10245567 hartree
nucrepener: 2578.90612721 hartree
electener: -3789.00858287 hartree
oneelecener: -6768.98619876 hartree
twoeener: 2979.97761589 hartree
cpcmener: -0.03011693 hartree
kineticenergy: 1204.70721834 hartree
xcener: -118.582801700709 hartree
chargesum: -0.0000000
charge: -0.276199 -0.447680 -0.333292 -0.086740 0.165937 -0.029229 -0.081871 -0.263833 -0.300151 -0.292256 0.369348 0.004766 -0.249420 -0.225063 0.407069 0.056820 -0.241212 -0.200829 -0.180708 0.194462 -0.112189 -0.224064 0.261173 -0.174768 -0.242563 -0.149516 -0.123389 -0.181902 0.107908 0.088476 0.101488 0.089086 0.092437 0.102309 0.089202 0.100493 0.124455 0.061438 0.097282 0.106508 0.087904 0.094812 0.095370 0.138500 0.147424 0.145630 0.159275 0.148750 0.153868 0.149712 0.159089 0.158031 0.157855
qa: -0.2762 -0.4477 -0.3333 -0.0867 0.1659 -0.0292 -0.0819 -0.2638 -0.3002 -0.2923 0.3693 0.0048 -0.2494 -0.2251 0.4071 0.0568 -0.2412 -0.2008 -0.1807 0.1945 -0.1122 -0.2241 0.2612 -0.1748 -0.2426 -0.1495 -0.1234 -0.1819 0.1079 0.0885 0.1015 0.0891 0.0924 0.1023 0.0892 0.1005 0.1245 0.0614 0.0973 0.1065 0.0879 0.0948 0.0954 0.1385 0.1474 0.1456 0.1593 0.1487 0.1539 0.1497 0.1591 0.1580 0.1579
va: 2.1196 2.0614 2.0341 3.1080 3.7266 3.8072 3.8320 3.8841 3.9253 3.8723 4.1927 3.7294 3.9465 3.9287 3.7761 3.5437 4.0703 3.8968 3.9535 3.7162 3.9014 4.0193 3.7275 3.8991 3.9846 3.9022 3.8907 3.9035 1.0122 1.0293 1.0008 1.0125 1.0012 0.9982 1.0021 1.0016 1.0054 1.0106 1.0039 0.9991 1.0077 0.9949 0.9964 1.0161 1.0122 1.0065 0.9885 1.0045 0.9987 1.0048 0.9904 0.9898 0.9904
dispcorr: -0.029227293 hartree
energy: -1210.131682961402
dipole: 23.20810 -22.18477 1.02333 11.10674 -11.31145 -0.20471 -7.52797 6.65319 -0.87479
magnitude: 1.36175 au
magnitude: 3.46129 debye
