program: Orca
programVersion: 5.0.2
elementType: O O O N C C C C C C C C C C C C C C C C C C C C C C C C H H H H H H H H H H H H H H H H H H H H H H H H H
charge: 0
multiplicity: 1
keywords: wb97x-d3
keywords: def2-TZVPP
keywords: def2/J RIJCOSX
keywords: DEFGRID2
keywords: scfconv7
keywords: smallprint printgap noloewdin
keywords: NOSOSCF
formula: C24H25NO3
InChI: InChI=1/C24H25NO3/c1-16(2)13-20-22(24(20,3)4)23(26)28-21(15-25)17-9-8-12-19(14-17)27-18-10-6-5-7-11-18/h5-14,20-22H,1-4H3
53 atoms
O  -0.72663 1.222715 -0.125328
O  -0.817299 3.143624 1.006774
O  -1.515927 -3.612583 -1.599178
N  -1.827063 0.248064 2.91722
C  1.425609 3.875175 -1.152133
C  1.992013 3.731634 0.216824
C  1.106293 2.629491 -0.331017
C  0.361167 4.915525 -1.396726
C  2.311926 3.635745 -2.349685
C  3.432391 3.471677 0.471943
C  -0.217278 2.40822 0.263365
C  3.905026 2.801894 1.526431
C  3.025023 2.188806 2.571649
C  5.375281 2.60624 1.734326
C  -2.004057 0.874176 0.381097
C  -2.530622 -0.304358 -0.398901
C  -1.894368 0.538562 1.807988
C  -1.732939 -1.426366 -0.598059
C  -3.820686 -0.251669 -0.905388
C  -2.247296 -2.500697 -1.310074
C  -4.319418 -1.334411 -1.61644
C  -3.541043 -2.459982 -1.818951
C  -0.571872 -4.08182 -0.724656
C  0.63087 -4.512462 -1.265127
C  -0.819688 -4.192376 0.638155
C  1.596131 -5.05896 -0.431203
C  0.159893 -4.728858 1.461106
C  1.368617 -5.164032 0.933697
H  1.497055 4.343491 0.967712
H  1.601665 1.726018 -0.66846
H  -0.231213 5.138632 -0.51132
H  0.828359 5.849213 -1.716484
H  -0.320631 4.602422 -2.190018
H  2.85373 4.546174 -2.614913
H  3.047027 2.849063 -2.179664
H  1.71417 3.345838 -3.215881
H  4.141019 3.885521 -0.24006
H  1.972179 2.441382 2.455287
H  3.108978 1.098395 2.5539
H  3.334766 2.503259 3.571476
H  5.701493 3.055606 2.676026
H  5.624571 1.543599 1.797979
H  5.967888 3.043239 0.930476
H  -2.70432 1.710201 0.296102
H  -0.723343 -1.457904 -0.205937
H  -4.433254 0.626916 -0.748061
H  -5.32443 -1.300819 -2.015533
H  -3.927023 -3.306036 -2.373521
H  0.80556 -4.42553 -2.330315
H  -1.7637 -3.869197 1.059279
H  2.532311 -5.399251 -0.854659
H  -0.030622 -4.813142 2.523236
H  2.125293 -5.586027 1.581848
elementType: O N C H
totalener: -1210.10690112 hartree
nucrepener: 2458.92237984 hartree
electener: -3669.02928096 hartree
oneelecener: -6529.37340503 hartree
twoeener: 2860.34412407 hartree
cpcmener: -0.03039612 hartree
kineticenergy: 1204.70634904 hartree
xcener: -118.581486023631 hartree
chargesum: -0.0000000
charge: -0.287155 -0.451613 -0.325729 -0.092383 0.146512 -0.027427 -0.088646 -0.271024 -0.286995 -0.291181 0.384216 -0.009877 -0.241170 -0.228308 0.422752 0.008658 -0.232282 -0.199286 -0.186975 0.242227 -0.123248 -0.225241 0.283006 -0.246810 -0.196975 -0.119315 -0.137938 -0.186128 0.104113 0.095996 0.092637 0.097270 0.100081 0.100019 0.093086 0.098697 0.123082 0.078897 0.100144 0.098831 0.096078 0.093978 0.089241 0.127423 0.147807 0.145778 0.158372 0.148585 0.146212 0.156335 0.157633 0.159587 0.158452
qa: -0.2872 -0.4516 -0.3257 -0.0924 0.1465 -0.0274 -0.0886 -0.2710 -0.2870 -0.2912 0.3842 -0.0099 -0.2412 -0.2283 0.4228 0.0087 -0.2323 -0.1993 -0.1870 0.2422 -0.1232 -0.2252 0.2830 -0.2468 -0.1970 -0.1193 -0.1379 -0.1861 0.1041 0.0960 0.0926 0.0973 0.1001 0.1000 0.0931 0.0987 0.1231 0.0789 0.1001 0.0988 0.0961 0.0940 0.0892 0.1274 0.1478 0.1458 0.1584 0.1486 0.1462 0.1563 0.1576 0.1596 0.1585
va: 2.1548 2.0512 2.0837 3.1095 3.7217 3.8264 3.8187 3.8901 3.9096 3.8904 4.1529 3.7065 3.9385 3.9316 3.7290 3.7373 4.0133 3.9538 3.9468 3.7770 3.9156 4.0015 3.6900 4.0129 3.9195 3.8815 3.8879 3.9078 1.0262 1.0270 1.0151 1.0013 0.9995 0.9993 1.0016 1.0031 1.0033 1.0177 0.9979 1.0005 0.9963 0.9963 1.0064 1.0264 1.0167 1.0025 0.9902 1.0051 1.0080 0.9974 0.9892 0.9901 0.9905
dispcorr: -0.024786305 hartree
energy: -1210.131687426271
dipole: 26.33731 -25.71539 0.62192 20.18250 -20.26161 -0.07911 -1.38066 -0.52566 -1.90632
magnitude: 2.00676 au
magnitude: 5.10079 debye
