program: Orca
programVersion: 5.0.2
elementType: O O O N C C C C C C C C C C C C C C C C C C C C C C C C H H H H H H H H H H H H H H H H H H H H H H H H H
charge: 0
multiplicity: 1
keywords: wb97x-d3
keywords: def2-TZVPP
keywords: def2/J RIJCOSX
keywords: DEFGRID2
keywords: scfconv7
keywords: smallprint printgap noloewdin
keywords: NOSOSCF
formula: C24H25NO3
InChI: InChI=1/C24H25NO3/c1-16(2)13-20-22(24(20,3)4)23(26)28-21(15-25)17-9-8-12-19(14-17)27-18-10-6-5-7-11-18/h5-14,20-22H,1-4H3
53 atoms
O  -0.708561 1.714329 -0.015879
O  1.163049 0.514516 -0.254304
O  -1.409255 -3.922294 0.445326
N  -3.250333 2.211556 -2.066418
C  2.114906 2.132255 2.259608
C  2.646694 2.784192 1.032321
C  1.160903 2.476139 1.121176
C  2.481007 0.697476 2.549275
C  1.932632 2.96062 3.508526
C  3.106062 4.197627 1.014976
C  0.591031 1.45855 0.230551
C  2.876203 5.068338 0.028632
C  2.094541 4.734513 -1.204382
C  3.385618 6.475545 0.0952
C  -1.393379 0.809857 -0.877788
C  -1.984113 -0.345277 -0.107636
C  -2.434094 1.607817 -1.529922
C  -1.414861 -1.604459 -0.242279
C  -3.051459 -0.138069 0.758606
C  -1.935873 -2.667715 0.485738
C  -3.554075 -1.206573 1.483714
C  -3.006047 -2.472188 1.348672
C  -0.76278 -4.380254 -0.672882
C  0.448433 -5.0284 -0.484177
C  -1.321672 -4.269065 -1.940076
C  1.104223 -5.578433 -1.576698
C  -0.64803 -4.811176 -3.024699
C  0.563046 -5.468207 -2.849691
H  3.188451 2.112487 0.369461
H  0.510608 3.322154 1.310413
H  2.747043 0.133192 1.658276
H  3.344655 0.672883 3.217372
H  1.664531 0.174063 3.051025
H  1.616076 3.981528 3.293706
H  1.179854 2.511604 4.159173
H  2.865723 3.013233 4.073644
H  3.69233 4.526218 1.869155
H  1.839582 3.679593 -1.284748
H  1.163928 5.308157 -1.240168
H  2.657276 5.007835 -2.100607
H  2.562657 7.192287 0.026967
H  3.928958 6.675307 1.018848
H  4.052565 6.693075 -0.743202
H  -0.732012 0.440967 -1.667789
H  -0.571804 -1.745602 -0.906674
H  -3.496021 0.843719 0.867229
H  -4.388132 -1.056756 2.156351
H  -3.402814 -3.307945 1.911279
H  0.868628 -5.107639 0.510673
H  -2.273172 -3.771859 -2.084604
H  2.046167 -6.090784 -1.428743
H  -1.080512 -4.7239 -4.013147
H  1.079301 -5.893425 -3.700281
elementType: O N C H
totalener: -1210.10586475 hartree
nucrepener: 2459.41340021 hartree
electener: -3669.51926496 hartree
oneelecener: -6530.30885476 hartree
twoeener: 2860.78958980 hartree
cpcmener: -0.02817038 hartree
kineticenergy: 1204.70683619 hartree
xcener: -118.581791539307 hartree
chargesum: 0.0000000
charge: -0.282042 -0.460791 -0.324385 -0.090003 0.142965 -0.005873 -0.117443 -0.282534 -0.282117 -0.299213 0.402537 -0.010612 -0.240896 -0.227326 0.402267 -0.013579 -0.223374 -0.159202 -0.218221 0.277697 -0.125048 -0.234639 0.281486 -0.243039 -0.197344 -0.122004 -0.139591 -0.181542 0.106691 0.096445 0.094626 0.095415 0.100173 0.093247 0.098623 0.098710 0.121629 0.082848 0.101213 0.101710 0.094217 0.089058 0.096298 0.132942 0.139174 0.143677 0.159601 0.147673 0.146762 0.157753 0.157998 0.159583 0.157797
qa: -0.2820 -0.4608 -0.3244 -0.0900 0.1430 -0.0059 -0.1174 -0.2825 -0.2821 -0.2992 0.4025 -0.0106 -0.2409 -0.2273 0.4023 -0.0136 -0.2234 -0.1592 -0.2182 0.2777 -0.1250 -0.2346 0.2815 -0.2430 -0.1973 -0.1220 -0.1396 -0.1815 0.1067 0.0964 0.0946 0.0954 0.1002 0.0932 0.0986 0.0987 0.1216 0.0828 0.1012 0.1017 0.0942 0.0891 0.0963 0.1329 0.1392 0.1437 0.1596 0.1477 0.1468 0.1578 0.1580 0.1596 0.1578
va: 2.1193 2.0476 2.0868 3.1122 3.7057 3.8036 3.8294 3.8943 3.9083 3.8922 4.1360 3.7118 3.9365 3.9315 3.7438 3.6601 4.0668 3.9002 3.9983 3.7487 3.9176 4.0178 3.6899 4.0157 3.9266 3.8829 3.8863 3.9057 1.0228 1.0292 1.0174 1.0012 0.9988 1.0026 1.0029 1.0001 1.0045 1.0122 0.9985 0.9997 0.9966 1.0065 0.9965 1.0210 1.0216 1.0085 0.9897 1.0061 1.0075 0.9961 0.9893 0.9899 0.9906
dispcorr: -0.025321247 hartree
energy: -1210.131185999340
dipole: 23.45216 -22.39159 1.06057 23.19248 -23.29647 -0.10400 9.60392 -8.75903 0.84490
magnitude: 1.35995 au
magnitude: 3.45672 debye
