program: Orca
programVersion: 5.0.2
elementType: O O O N C C C C C C C C C C C C C C C C C C C C C C C C H H H H H H H H H H H H H H H H H H H H H H H H H
charge: 0
multiplicity: 1
keywords: wb97x-d3
keywords: def2-TZVPP
keywords: def2/J RIJCOSX
keywords: DEFGRID2
keywords: scfconv7
keywords: smallprint printgap noloewdin
keywords: NOSOSCF
formula: C24H25NO3
InChI: InChI=1/C24H25NO3/c1-16(2)13-20-22(24(20,3)4)23(26)28-21(15-25)17-9-8-12-19(14-17)27-18-10-6-5-7-11-18/h5-14,20-22H,1-4H3
53 atoms
O  -1.241791 2.323583 0.278835
O  -1.279804 2.653947 -1.925811
O  0.238696 -2.476015 0.488262
N  -3.438469 1.469715 2.581197
C  1.130105 4.232845 0.419227
C  1.625781 2.834154 0.307751
C  0.627403 3.361639 -0.72209
C  0.241545 4.615384 1.578748
C  2.029608 5.36551 -0.018245
C  3.008214 2.486526 -0.10584
C  -0.708369 2.770602 -0.869717
C  3.374224 1.305351 -0.61224
C  2.412091 0.187224 -0.873636
C  4.803324 1.010549 -0.948623
C  -2.424198 1.542615 0.174223
C  -2.113479 0.14706 -0.313494
C  -2.981005 1.511913 1.52841
C  -1.128858 -0.589418 0.33296
C  -2.777093 -0.376211 -1.412622
C  -0.791249 -1.846532 -0.143163
C  -2.440496 -1.6435 -1.867874
C  -1.443537 -2.381199 -1.249508
C  0.283491 -3.8436 0.555088
C  1.491374 -4.457347 0.260164
C  -0.813604 -4.59007 0.96682
C  1.602731 -5.835312 0.383768
C  -0.691294 -5.967569 1.07362
C  0.5130 -6.595843 0.783731
H  1.181968 2.147612 1.023378
H  1.047189 3.609879 -1.690209
H  -0.284295 3.773193 2.021549
H  0.853035 5.060666 2.366388
H  -0.498408 5.360764 1.280975
H  2.720226 5.63965 0.781893
H  2.621421 5.121459 -0.900589
H  1.436501 6.250309 -0.257325
H  3.774143 3.240432 0.052286
H  2.587161 -0.64583 -0.187095
H  1.369637 0.485959 -0.775883
H  2.548738 -0.212343 -1.881707
H  5.462239 1.848773 -0.721798
H  5.164614 0.139141 -0.395834
H  4.91548 0.769907 -2.009271
H  -3.165572 2.018107 -0.475449
H  -0.610957 -0.192869 1.198759
H  -3.541671 0.201405 -1.916011
H  -2.945654 -2.056661 -2.730864
H  -1.177462 -3.356685 -1.636009
H  2.337353 -3.859807 -0.056448
H  -1.752459 -4.10687 1.208256
H  2.546482 -6.314316 0.15692
H  -1.544517 -6.550993 1.394829
H  0.602176 -7.670308 0.874827
elementType: O N C H
totalener: -1210.10303105 hartree
nucrepener: 2527.19218767 hartree
electener: -3737.29521872 hartree
oneelecener: -6665.60334107 hartree
twoeener: 2928.30812234 hartree
cpcmener: -0.03046266 hartree
kineticenergy: 1204.71215870 hartree
xcener: -118.584039803918 hartree
chargesum: 0.0000000
charge: -0.275391 -0.445003 -0.326340 -0.087158 0.162672 -0.018402 -0.093103 -0.268227 -0.298854 -0.298880 0.372638 -0.005789 -0.226736 -0.226593 0.396562 0.075156 -0.235312 -0.310510 -0.197804 0.264304 -0.122470 -0.186852 0.262492 -0.239088 -0.184147 -0.126473 -0.146767 -0.177936 0.109447 0.090371 0.090454 0.093534 0.100792 0.100896 0.092799 0.099463 0.123242 0.102906 0.054382 0.097145 0.088567 0.094650 0.095345 0.139226 0.141679 0.146323 0.160220 0.157521 0.150697 0.158049 0.158903 0.159282 0.158116
qa: -0.2754 -0.4450 -0.3263 -0.0872 0.1627 -0.0184 -0.0931 -0.2682 -0.2989 -0.2989 0.3726 -0.0058 -0.2267 -0.2266 0.3966 0.0752 -0.2353 -0.3105 -0.1978 0.2643 -0.1225 -0.1869 0.2625 -0.2391 -0.1841 -0.1265 -0.1468 -0.1779 0.1094 0.0904 0.0905 0.0935 0.1008 0.1009 0.0928 0.0995 0.1232 0.1029 0.0544 0.0971 0.0886 0.0947 0.0953 0.1392 0.1417 0.1463 0.1602 0.1575 0.1507 0.1580 0.1589 0.1593 0.1581
va: 2.1155 2.0657 2.0466 3.1077 3.7067 3.8050 3.8387 3.8920 3.9228 3.8644 4.1776 3.7362 3.9409 3.9274 3.7713 3.5445 4.0720 4.0188 3.9794 3.7212 3.9062 3.9409 3.7194 3.9911 3.9270 3.8887 3.8977 3.8997 1.0155 1.0284 1.0111 1.0010 1.0003 0.9987 1.0015 1.0022 1.0044 1.0041 1.0161 1.0020 1.0072 0.9951 0.9967 1.0155 1.0250 1.0037 0.9903 0.9962 1.0032 0.9966 0.9898 0.9902 0.9903
dispcorr: -0.028329859 hartree
energy: -1210.131360911037
dipole: 24.06068 -22.87057 1.19010 10.69402 -11.52555 -0.83153 -3.39023 2.44760 -0.94263
magnitude: 1.73099 au
magnitude: 4.39984 debye
