program: Orca
programVersion: 5.0.2
elementType: O O O N C C C C C C C C C C C C C C C C C C C C C C C C H H H H H H H H H H H H H H H H H H H H H H H H H
charge: 0
multiplicity: 1
keywords: wb97x-d3
keywords: def2-TZVPP
keywords: def2/J RIJCOSX
keywords: DEFGRID2
keywords: scfconv7
keywords: smallprint printgap noloewdin
keywords: NOSOSCF
formula: C24H25NO3
InChI: InChI=1/C24H25NO3/c1-16(2)13-20-22(24(20,3)4)23(26)28-21(15-25)17-9-8-12-19(14-17)27-18-10-6-5-7-11-18/h5-14,20-22H,1-4H3
53 atoms
O  -0.419571 1.109917 0.200891
O  -0.934351 3.23991 0.672788
O  -1.608784 -3.626431 -1.706041
N  -1.215463 -0.409833 3.069716
C  1.481374 3.802785 -1.284087
C  1.88935 3.992932 0.133826
C  1.198927 2.7007 -0.267649
C  0.351262 4.627821 -1.849303
C  2.537404 3.461697 -2.307751
C  3.309672 3.966243 0.568986
C  -0.148615 2.432588 0.246684
C  3.744799 3.444858 1.718886
C  2.843066 2.788144 2.719494
C  5.197546 3.46341 2.083329
C  -1.660453 0.660196 0.723806
C  -2.278041 -0.346857 -0.211499
C  -1.398775 0.060203 2.037518
C  -1.605388 -1.529413 -0.502564
C  -3.517426 -0.078248 -0.772372
C  -2.202111 -2.455356 -1.345865
C  -4.09214 -1.005813 -1.63093
C  -3.445386 -2.195216 -1.913582
C  -0.751813 -4.281314 -0.861955
C  0.374267 -4.853923 -1.435311
C  -1.018033 -4.439526 0.49283
C  1.241083 -5.594547 -0.644584
C  -0.134055 -5.170209 1.273569
C  0.99571 -5.750456 0.712278
H  1.245636 4.664587 0.697796
H  1.828687 1.823353 -0.360067
H  -0.347702 4.97631 -1.091971
H  0.757335 5.511522 -2.345623
H  -0.211274 4.064379 -2.59653
H  3.322975 2.821877 -1.905272
H  2.094134 2.942117 -3.159237
H  3.010652 4.369927 -2.686882
H  4.033599 4.426134 -0.098306
H  3.057964 3.149374 3.728042
H  1.784949 2.957018 2.526442
H  3.008914 1.707067 2.739027
H  5.812294 3.916973 1.305797
H  5.364038 4.016224 3.011561
H  5.569228 2.450077 2.258105
H  -2.352863 1.491874 0.875841
H  -0.631694 -1.724371 -0.068001
H  -4.031906 0.845765 -0.541157
H  -5.058187 -0.804478 -2.074523
H  -3.89733 -2.925571 -2.57286
H  0.564181 -4.726448 -2.493831
H  -1.903082 -4.006241 0.941997
H  2.116183 -6.044728 -1.095185
H  -0.338652 -5.290573 2.32962
H  1.677408 -6.32228 1.327962
elementType: O N C H
totalener: -1210.10568932 hartree
nucrepener: 2445.70168891 hartree
electener: -3655.80737823 hartree
oneelecener: -6502.86184920 hartree
twoeener: 2847.05447097 hartree
cpcmener: -0.02838300 hartree
kineticenergy: 1204.70665053 hartree
xcener: -118.581507405714 hartree
chargesum: 0.0000000
charge: -0.290357 -0.452981 -0.324658 -0.092476 0.146966 -0.011986 -0.115168 -0.276977 -0.285276 -0.300656 0.394235 -0.005205 -0.242903 -0.228475 0.433362 0.014473 -0.230131 -0.236276 -0.186845 0.275816 -0.110742 -0.239807 0.299697 -0.252885 -0.208986 -0.116265 -0.134885 -0.187652 0.104331 0.095817 0.093122 0.095153 0.100501 0.093981 0.098056 0.099448 0.121581 0.100609 0.081201 0.102253 0.088909 0.096268 0.094656 0.120996 0.149289 0.147921 0.158991 0.148076 0.145799 0.156090 0.157257 0.159587 0.157150
qa: -0.2904 -0.4530 -0.3247 -0.0925 0.1470 -0.0120 -0.1152 -0.2770 -0.2853 -0.3007 0.3942 -0.0052 -0.2429 -0.2285 0.4334 0.0145 -0.2301 -0.2363 -0.1868 0.2758 -0.1107 -0.2398 0.2997 -0.2529 -0.2090 -0.1163 -0.1349 -0.1877 0.1043 0.0958 0.0931 0.0952 0.1005 0.0940 0.0981 0.0994 0.1216 0.1006 0.0812 0.1023 0.0889 0.0963 0.0947 0.1210 0.1493 0.1479 0.1590 0.1481 0.1458 0.1561 0.1573 0.1596 0.1571
va: 2.1367 2.0574 2.0893 3.1086 3.7043 3.8131 3.8100 3.8959 3.9109 3.8949 4.1703 3.7026 3.9385 3.9324 3.6808 3.7289 4.0707 3.9776 3.9323 3.7557 3.9021 4.0104 3.6755 4.0154 3.9217 3.8792 3.8848 3.9108 1.0251 1.0279 1.0162 1.0015 0.9989 1.0015 1.0032 0.9996 1.0041 1.0007 1.0140 0.9977 1.0065 0.9966 0.9961 1.0449 1.0124 1.0002 0.9897 1.0059 1.0083 0.9974 0.9892 0.9899 0.9909
dispcorr: -0.024854879 hartree
energy: -1210.130544199965
dipole: 24.96090 -24.40258 0.55832 22.62760 -22.50019 0.12741 -1.29080 -0.24328 -1.53408
magnitude: 1.63749 au
magnitude: 4.16216 debye
