program: Orca
programVersion: 5.0.2
elementType: O O O N C C C C C C C C C C C C C C C C C C C C C C C C H H H H H H H H H H H H H H H H H H H H H H H H H
charge: 0
multiplicity: 1
keywords: wb97x-d3
keywords: def2-TZVPP
keywords: def2/J RIJCOSX
keywords: DEFGRID2
keywords: scfconv7
keywords: smallprint printgap noloewdin
keywords: NOSOSCF
formula: C24H25NO3
InChI: InChI=1/C24H25NO3/c1-16(2)13-20-22(24(20,3)4)23(26)28-21(15-25)17-9-8-12-19(14-17)27-18-10-6-5-7-11-18/h5-14,20-22H,1-4H3
53 atoms
O  -1.070113 1.369334 -0.459589
O  -1.017131 3.386311 0.492022
O  -1.384187 -3.660644 -0.699007
N  -2.182794 1.116522 2.745002
C  1.676259 3.7984 -1.07933
C  2.01503 3.074418 0.177271
C  0.892621 2.5519 -0.712162
C  1.050672 5.168891 -0.992262
C  2.578372 3.633209 -2.279376
C  3.253236 2.269484 0.3376
C  -0.469803 2.541342 -0.170518
C  3.311552 1.048773 0.877014
C  2.111132 0.30504 1.383399
C  4.608956 0.308664 0.9896
C  -2.32794 1.100572 0.129813
C  -2.754482 -0.285249 -0.292678
C  -2.229641 1.138534 1.597091
C  -1.820879 -1.3179 -0.28761
C  -4.075323 -0.519634 -0.637109
C  -2.227752 -2.596059 -0.639219
C  -4.467529 -1.807828 -0.980469
C  -3.554433 -2.845565 -0.98312
C  -0.128421 -3.578927 -0.146641
C  0.967369 -3.618564 -0.994238
C  0.033215 -3.51929 1.231088
C  2.245864 -3.610846 -0.451291
C  1.315239 -3.503265 1.76057
C  2.423757 -3.550695 0.923853
H  1.657836 3.565134 1.080672
H  1.139827 1.669578 -1.29096
H  0.507265 5.335061 -0.065022
H  1.834254 5.927515 -1.049103
H  0.365033 5.346153 -1.823102
H  2.029136 3.835751 -3.200839
H  3.413707 4.334764 -2.233556
H  2.992733 2.627851 -2.357345
H  4.176443 2.732787 -0.001075
H  1.251228 0.945197 1.57161
H  1.805596 -0.467425 0.67129
H  2.345253 -0.211296 2.316727
H  4.846735 0.088595 2.033491
H  4.552315 -0.656213 0.477328
H  5.442585 0.867405 0.563814
H  -3.077026 1.83862 -0.173921
H  -0.791017 -1.121026 -0.016481
H  -4.79353 0.290462 -0.637674
H  -5.497266 -2.00355 -1.249025
H  -3.859584 -3.848788 -1.25311
H  0.821443 -3.667055 -2.066324
H  -0.831296 -3.49211 1.883313
H  3.104152 -3.650743 -1.109719
H  1.446563 -3.459042 2.834188
H  3.421415 -3.541943 1.343107
elementType: O N C H
totalener: -1210.10431978 hartree
nucrepener: 2563.36814738 hartree
electener: -3773.47246716 hartree
oneelecener: -6738.11657527 hartree
twoeener: 2964.64410812 hartree
cpcmener: -0.03094744 hartree
kineticenergy: 1204.69934175 hartree
xcener: -118.581887403991 hartree
chargesum: -0.0000000
charge: -0.281462 -0.443468 -0.322831 -0.091141 0.159007 -0.002206 -0.118912 -0.284781 -0.283482 -0.294503 0.374247 0.006838 -0.249713 -0.232067 0.405914 -0.005189 -0.235919 -0.173152 -0.217439 0.272036 -0.101814 -0.242922 0.247033 -0.200835 -0.177596 -0.120343 -0.145234 -0.186805 0.111714 0.094508 0.094154 0.093731 0.099494 0.098090 0.099343 0.093322 0.121000 0.089397 0.083490 0.109857 0.097547 0.087733 0.091406 0.133828 0.124853 0.143994 0.157115 0.145484 0.147574 0.155115 0.157137 0.158524 0.158331
qa: -0.2815 -0.4435 -0.3228 -0.0911 0.1590 -0.0022 -0.1189 -0.2848 -0.2835 -0.2945 0.3742 0.0068 -0.2497 -0.2321 0.4059 -0.0052 -0.2359 -0.1732 -0.2174 0.2720 -0.1018 -0.2429 0.2470 -0.2008 -0.1776 -0.1203 -0.1452 -0.1868 0.1117 0.0945 0.0942 0.0937 0.0995 0.0981 0.0993 0.0933 0.1210 0.0894 0.0835 0.1099 0.0975 0.0877 0.0914 0.1338 0.1249 0.1440 0.1571 0.1455 0.1476 0.1551 0.1571 0.1585 0.1583
va: 2.1341 2.0593 2.0894 3.1051 3.7044 3.8090 3.8447 3.8900 3.9070 3.8935 4.1632 3.6712 3.9513 3.9358 3.7603 3.7703 4.0176 3.9272 3.9693 3.7674 3.9044 4.0000 3.7159 3.9978 3.9372 3.8475 3.8396 3.8488 1.0193 1.0278 1.0186 1.0008 0.9992 1.0032 1.0005 1.0023 1.0037 1.0144 0.9988 0.9981 0.9965 0.9983 1.0077 1.0168 1.0282 1.0039 0.9894 1.0079 1.0044 0.9973 0.9899 0.9913 0.9914
dispcorr: -0.029113492 hartree
energy: -1210.133433272888
dipole: 26.76667 -25.79350 0.97316 12.44078 -13.16788 -0.72710 -4.08572 2.17829 -1.90743
magnitude: 2.26142 au
magnitude: 5.74807 debye
