program: Orca
programVersion: 5.0.2
elementType: O O O N C C C C C C C C C C C C C C C C C C C C C C C C H H H H H H H H H H H H H H H H H H H H H H H H H
charge: 0
multiplicity: 1
keywords: wb97x-d3
keywords: def2-TZVPP
keywords: def2/J RIJCOSX
keywords: DEFGRID2
keywords: scfconv7
keywords: smallprint printgap noloewdin
keywords: NOSOSCF
formula: C24H25NO3
InChI: InChI=1/C24H25NO3/c1-16(2)13-20-22(24(20,3)4)23(26)28-21(15-25)17-9-8-12-19(14-17)27-18-10-6-5-7-11-18/h5-14,20-22H,1-4H3
53 atoms
O  -0.70365 1.789097 -0.558641
O  1.17065 0.752494 0.074742
O  -1.225025 -3.909079 0.670579
N  -2.887847 1.374835 -2.992283
C  1.257111 3.05175 2.213141
C  2.179901 3.397769 1.087405
C  0.742035 3.003698 0.782662
C  1.506124 1.776421 2.980687
C  0.680753 4.149076 3.075852
C  2.610483 4.778164 0.795102
C  0.472487 1.734268 0.095302
C  3.830492 5.172376 0.414977
C  5.008473 4.266421 0.223276
C  4.110989 6.618672 0.135222
C  -1.104428 0.609421 -1.243357
C  -1.697593 -0.416022 -0.305911
C  -2.098672 1.057244 -2.221081
C  -1.175029 -1.699493 -0.283976
C  -2.745814 -0.062382 0.537873
C  -1.725361 -2.643195 0.575797
C  -3.268846 -1.008416 1.403465
C  -2.769072 -2.302888 1.422002
C  -0.915467 -4.616226 -0.459359
C  0.162223 -5.487569 -0.377307
C  -1.666857 -4.526232 -1.625068
C  0.489313 -6.273575 -1.47248
C  -1.319904 -5.311037 -2.715747
C  -0.244131 -6.185631 -2.647798
H  2.900951 2.620908 0.857675
H  0.071168 3.811608 0.512562
H  2.051605 1.027917 2.410526
H  2.098703 2.000564 3.870044
H  0.568561 1.329136 3.317445
H  0.393011 5.033964 2.509645
H  -0.209657 3.792744 3.597335
H  1.404443 4.459764 3.832257
H  1.845934 5.543767 0.890649
H  5.858856 4.616465 0.814016
H  4.821644 3.230578 0.499766
H  5.335888 4.277053 -0.820066
H  3.228783 7.244787 0.269328
H  4.898411 7.001621 0.789998
H  4.468526 6.75777 -0.888897
H  -0.2717 0.174019 -1.805188
H  -0.344689 -1.957994 -0.930235
H  -3.154457 0.940609 0.522351
H  -4.084748 -0.743593 2.062769
H  -3.18562 -3.045661 2.090678
H  0.735441 -5.552012 0.539203
H  -2.517878 -3.85993 -1.690693
H  1.328369 -6.954068 -1.404515
H  -1.904285 -5.238609 -3.623946
H  0.018087 -6.795799 -3.50196
elementType: O N C H
totalener: -1210.10782858 hartree
nucrepener: 2420.04732432 hartree
electener: -3630.15515289 hartree
oneelecener: -6451.53979108 hartree
twoeener: 2821.38463818 hartree
cpcmener: -0.03035243 hartree
kineticenergy: 1204.70631561 hartree
xcener: -118.582653626986 hartree
chargesum: -0.0000000
charge: -0.283239 -0.451873 -0.327679 -0.088535 0.099634 0.038478 -0.087848 -0.272440 -0.272081 -0.273056 0.389261 -0.049053 -0.251749 -0.216110 0.404336 0.017135 -0.225177 -0.166763 -0.217951 0.241942 -0.130648 -0.213239 0.282387 -0.250753 -0.186763 -0.119041 -0.146954 -0.188238 0.095636 0.090084 0.093715 0.096529 0.098531 0.088701 0.098045 0.098598 0.116099 0.094499 0.090093 0.097375 0.087379 0.093529 0.092580 0.136325 0.147113 0.147564 0.159306 0.148914 0.145942 0.155196 0.157492 0.159057 0.157713
qa: -0.2832 -0.4519 -0.3277 -0.0885 0.0996 0.0385 -0.0878 -0.2724 -0.2721 -0.2731 0.3893 -0.0491 -0.2517 -0.2161 0.4043 0.0171 -0.2252 -0.1668 -0.2180 0.2419 -0.1306 -0.2132 0.2824 -0.2508 -0.1868 -0.1190 -0.1470 -0.1882 0.0956 0.0901 0.0937 0.0965 0.0985 0.0887 0.0980 0.0986 0.1161 0.0945 0.0901 0.0974 0.0874 0.0935 0.0926 0.1363 0.1471 0.1476 0.1593 0.1489 0.1459 0.1552 0.1575 0.1591 0.1577
va: 2.1277 2.0637 2.0787 3.1121 3.6966 3.7869 3.8373 3.9034 3.9131 3.8828 4.1827 3.7689 3.9404 3.9206 3.7395 3.5820 4.0762 3.9486 3.9738 3.7628 3.9132 4.0121 3.6991 4.0042 3.8955 3.8846 3.8970 3.9068 1.0288 1.0354 1.0181 1.0001 0.9996 1.0069 1.0014 1.0015 1.0119 0.9976 1.0105 0.9964 1.0092 0.9965 0.9962 1.0197 1.0084 1.0103 0.9895 1.0042 1.0084 0.9979 0.9891 0.9905 0.9906
dispcorr: -0.024302704 hartree
energy: -1210.132131281229
dipole: 24.58338 -23.69313 0.89026 26.84461 -26.52634 0.31827 13.50731 -12.36619 1.14112
magnitude: 1.48189 au
magnitude: 3.76666 debye
