program: Orca
programVersion: 5.0.2
elementType: O O O N C C C C C C C C C C C C C C C C C C C C C C C C H H H H H H H H H H H H H H H H H H H H H H H H H
charge: 0
multiplicity: 1
keywords: wb97x-d3
keywords: def2-TZVPP
keywords: def2/J RIJCOSX
keywords: DEFGRID2
keywords: scfconv7
keywords: smallprint printgap noloewdin
keywords: NOSOSCF
formula: C24H25NO3
InChI: InChI=1/C24H25NO3/c1-16(2)13-20-22(24(20,3)4)23(26)28-21(15-25)17-9-8-12-19(14-17)27-18-10-6-5-7-11-18/h5-14,20-22H,1-4H3
53 atoms
O  -1.456611 2.283483 -0.015925
O  -1.391633 2.122484 -2.238299
O  -0.767266 -2.598316 1.143689
N  -3.800405 2.242191 2.302504
C  1.302589 3.543029 -0.076949
C  1.470403 2.057802 0.003051
C  0.606135 2.669531 -1.10206
C  0.5434 4.247341 1.023101
C  2.424551 4.391436 -0.630473
C  2.710412 1.347277 -0.359146
C  -0.823703 2.349821 -1.199019
C  3.215304 0.276576 0.264882
C  2.601802 -0.385897 1.462976
C  4.5025 -0.340069 -0.192819
C  -2.746734 1.687926 -0.022666
C  -2.650342 0.193356 -0.22057
C  -3.323474 2.006335 1.284916
C  -1.75966 -0.536415 0.56047
C  -3.397525 -0.434663 -1.203871
C  -1.628142 -1.895414 0.344679
C  -3.263736 -1.803457 -1.398984
C  -2.378382 -2.540785 -0.63113
C  0.32382 -3.196645 0.578355
C  0.881041 -2.775266 -0.623113
C  0.894942 -4.242081 1.294046
C  2.016173 -3.415389 -1.103198
C  2.031537 -4.865725 0.803564
C  2.596973 -4.460085 -0.398773
H  0.89768 1.60431 0.804005
H  1.062327 2.687787 -2.08567
H  -0.127526 3.595728 1.57706
H  1.25604 4.658669 1.740826
H  -0.03968 5.082364 0.629746
H  2.91526 3.944385 -1.494222
H  2.042321 5.36539 -0.942259
H  3.186284 4.564384 0.132325
H  3.257603 1.73946 -1.211343
H  1.53862 -0.187466 1.582324
H  2.730294 -1.468173 1.414408
H  3.098989 -0.058555 2.379786
H  4.949823 0.200598 -1.026925
H  5.233496 -0.370851 0.619929
H  4.347614 -1.376924 -0.504729
H  -3.394129 2.134269 -0.783978
H  -1.164609 -0.058696 1.330459
H  -4.07908 0.138783 -1.819264
H  -3.848839 -2.297861 -2.162883
H  -2.270368 -3.607009 -0.78766
H  0.455465 -1.951635 -1.181875
H  0.450593 -4.559874 2.229215
H  2.449161 -3.085321 -2.03885
H  2.47204 -5.679934 1.364595
H  3.480979 -4.952941 -0.781236
elementType: O N C H
totalener: -1210.10331722 hartree
nucrepener: 2600.61153320 hartree
electener: -3810.71485042 hartree
oneelecener: -6812.18840705 hartree
twoeener: 3001.47355663 hartree
cpcmener: -0.03129714 hartree
kineticenergy: 1204.71432376 hartree
xcener: -118.585797046748 hartree
chargesum: -0.0000000
charge: -0.279699 -0.441918 -0.328207 -0.085475 0.108761 0.042365 -0.074457 -0.265940 -0.281151 -0.273885 0.368513 -0.045098 -0.264483 -0.211126 0.389723 0.005325 -0.234563 -0.205466 -0.167885 0.180847 -0.129129 -0.147006 0.263316 -0.142920 -0.230829 -0.216075 -0.129139 -0.160967 0.100252 0.087268 0.088458 0.093438 0.100340 0.089270 0.098791 0.098718 0.115241 0.085802 0.076963 0.120942 0.088153 0.098215 0.086408 0.140464 0.153563 0.146211 0.160908 0.158753 0.146793 0.145582 0.161151 0.156677 0.158209
qa: -0.2797 -0.4419 -0.3282 -0.0855 0.1088 0.0424 -0.0745 -0.2659 -0.2812 -0.2739 0.3685 -0.0451 -0.2645 -0.2111 0.3897 0.0053 -0.2346 -0.2055 -0.1679 0.1808 -0.1291 -0.1470 0.2633 -0.1429 -0.2308 -0.2161 -0.1291 -0.1610 0.1003 0.0873 0.0885 0.0934 0.1003 0.0893 0.0988 0.0987 0.1152 0.0858 0.0770 0.1209 0.0882 0.0982 0.0864 0.1405 0.1536 0.1462 0.1609 0.1588 0.1468 0.1456 0.1612 0.1567 0.1582
va: 2.1135 2.0678 2.0552 3.1078 3.7116 3.7652 3.8356 3.9041 3.9234 3.8663 4.2029 3.7571 3.9527 3.9160 3.7720 3.6136 4.0707 4.0101 3.9612 3.8588 3.8905 3.9492 3.6648 3.7666 3.9820 3.8984 3.9103 3.8648 1.0102 1.0314 1.0117 1.0000 1.0010 1.0069 1.0009 1.0007 1.0131 1.0084 0.9978 0.9981 1.0101 0.9953 0.9987 1.0153 1.0111 1.0026 0.9895 0.9942 1.0070 1.0087 0.9905 0.9893 0.9896
dispcorr: -0.030619167 hartree
energy: -1210.133936387007
dipole: 29.29513 -27.77277 1.52237 6.16901 -6.78324 -0.61423 -0.63973 -0.34697 -0.98670
magnitude: 1.91532 au
magnitude: 4.86837 debye
