program: Orca
programVersion: 5.0.2
elementType: O O O N C C C C C C C C C C C C C C C C C C C C C C C C H H H H H H H H H H H H H H H H H H H H H H H H H
charge: 0
multiplicity: 1
keywords: wb97x-d3
keywords: def2-TZVPP
keywords: def2/J RIJCOSX
keywords: DEFGRID2
keywords: scfconv7
keywords: smallprint printgap noloewdin
keywords: NOSOSCF
formula: C24H25NO3
InChI: InChI=1/C24H25NO3/c1-16(2)13-20-22(24(20,3)4)23(26)28-21(15-25)17-9-8-12-19(14-17)27-18-10-6-5-7-11-18/h5-14,20-22H,1-4H3
53 atoms
O  -0.820036 1.487679 1.283014
O  -0.527651 2.430465 -0.721112
O  -0.212218 -3.161617 -0.471616
N  -3.3718 0.446845 3.091746
C  2.510652 2.149239 0.061767
C  2.073574 3.562601 0.293292
C  1.258412 2.423927 0.881831
C  2.409403 1.584663 -1.334527
C  3.684424 1.594483 0.832135
C  2.778431 4.482941 1.206259
C  -0.086155 2.14354 0.36223
C  3.068289 5.757989 0.931033
C  2.702512 6.418256 -0.372646
C  3.7891 6.618181 1.922786
C  -2.118678 1.076963 0.886441
C  -2.088673 -0.103888 -0.057661
C  -2.803313 0.720662 2.132036
C  -1.202808 -1.148144 0.173261
C  -2.95155 -0.139646 -1.142486
C  -1.167539 -2.21923 -0.706859
C  -2.917818 -1.227154 -2.003702
C  -2.024831 -2.26724 -1.801135
C  -0.434631 -4.487272 -0.724402
C  0.642976 -5.215953 -1.208814
C  -1.645326 -5.110255 -0.447534
C  0.507983 -6.581074 -1.413766
C  -1.768577 -6.474833 -0.669712
C  -0.697865 -7.216289 -1.15083
H  1.617525 4.029369 -0.574208
H  1.369155 2.258009 1.947593
H  1.634434 2.054001 -1.938078
H  3.359474 1.735252 -1.853371
H  2.215565 0.509724 -1.310866
H  3.649616 0.503357 0.844496
H  4.623911 1.889564 0.359659
H  3.714427 1.93119 1.867491
H  3.075138 4.083126 2.171218
H  3.036352 7.455597 -0.397123
H  3.15497 5.914867 -1.229212
H  1.623413 6.425268 -0.5404
H  4.026212 6.080953 2.841439
H  4.724773 6.999689 1.50452
H  3.192921 7.495319 2.189764
H  -2.677872 1.902708 0.433268
H  -0.528402 -1.136741 1.021499
H  -3.638288 0.677932 -1.321517
H  -3.582104 -1.258014 -2.857374
H  -1.994533 -3.095462 -2.497676
H  1.581443 -4.716614 -1.415161
H  -2.484271 -4.549249 -0.054975
H  1.351559 -7.147482 -1.786834
H  -2.711397 -6.961029 -0.453749
H  -0.802039 -8.280506 -1.316255
elementType: O N C H
totalener: -1210.10623850 hartree
nucrepener: 2421.25784044 hartree
electener: -3631.36407894 hartree
oneelecener: -6454.01854981 hartree
twoeener: 2822.65447088 hartree
cpcmener: -0.03065421 hartree
kineticenergy: 1204.69336864 hartree
xcener: -118.580021196082 hartree
chargesum: 0.0000000
charge: -0.287218 -0.445341 -0.326089 -0.088977 0.100930 0.054361 -0.095736 -0.272872 -0.270413 -0.301959 0.373997 -0.009154 -0.284595 -0.221772 0.415722 0.025469 -0.229969 -0.248586 -0.200940 0.264296 -0.124173 -0.190111 0.290613 -0.252260 -0.199133 -0.121314 -0.144704 -0.185324 0.094046 0.090156 0.094000 0.097415 0.097071 0.097994 0.098630 0.088392 0.116827 0.094779 0.105376 0.102471 0.084403 0.096750 0.097200 0.142089 0.134219 0.145369 0.160314 0.158380 0.145966 0.157860 0.157832 0.159687 0.158026
qa: -0.2872 -0.4453 -0.3261 -0.0890 0.1009 0.0544 -0.0957 -0.2729 -0.2704 -0.3020 0.3740 -0.0092 -0.2846 -0.2218 0.4157 0.0255 -0.2300 -0.2486 -0.2009 0.2643 -0.1242 -0.1901 0.2906 -0.2523 -0.1991 -0.1213 -0.1447 -0.1853 0.0940 0.0902 0.0940 0.0974 0.0971 0.0980 0.0986 0.0884 0.1168 0.0948 0.1054 0.1025 0.0844 0.0968 0.0972 0.1421 0.1342 0.1454 0.1603 0.1584 0.1460 0.1579 0.1578 0.1597 0.1580
va: 2.1158 2.0657 2.0750 3.1134 3.7077 3.7798 3.8556 3.9044 3.9124 3.9023 4.1933 3.6942 3.9401 3.9202 3.7152 3.6160 4.0803 4.0533 3.9916 3.7638 3.8986 3.9298 3.6891 4.0081 3.9102 3.8881 3.8896 3.9059 1.0258 1.0364 1.0183 1.0004 1.0000 1.0021 1.0014 1.0063 1.0103 1.0047 0.9950 0.9970 1.0104 0.9929 0.9928 1.0163 1.0300 1.0026 0.9904 0.9943 1.0084 0.9973 0.9893 0.9901 0.9905
dispcorr: -0.024500258 hartree
energy: -1210.130738754636
dipole: 27.67477 -26.56807 1.10670 23.31681 -23.35928 -0.04247 -4.08390 2.73914 -1.34475
magnitude: 1.74211 au
magnitude: 4.42809 debye
