program: Orca
programVersion: 5.0.2
elementType: O O O N C C C C C C C C C C C C C C C C C C C C C C C C H H H H H H H H H H H H H H H H H H H H H H H H H
charge: 0
multiplicity: 1
keywords: wb97x-d3
keywords: def2-TZVPP
keywords: def2/J RIJCOSX
keywords: DEFGRID2
keywords: scfconv7
keywords: smallprint printgap noloewdin
keywords: NOSOSCF
formula: C24H25NO3
InChI: InChI=1/C24H25NO3/c1-16(2)13-20-22(24(20,3)4)23(26)28-21(15-25)17-9-8-12-19(14-17)27-18-10-6-5-7-11-18/h5-14,20-22H,1-4H3
53 atoms
O  0.05402 0.946185 0.752272
O  -1.015484 2.879787 0.388706
O  -1.405681 -3.422984 -1.975733
N  -0.53667 -1.261207 3.144135
C  1.527075 3.545814 -1.318739
C  1.664119 4.173987 0.022874
C  1.327761 2.694325 -0.069237
C  0.351921 3.913117 -2.191095
C  2.772914 3.225242 -2.109215
C  2.979187 4.592127 0.574617
C  0.002879 2.234952 0.361148
C  3.328971 4.516223 1.861136
C  2.431525 3.972425 2.929851
C  4.678332 4.966383 2.330161
C  -1.162293 0.341532 1.178361
C  -1.825397 -0.397032 0.042839
C  -0.797198 -0.562171 2.270906
C  -1.284667 -1.592219 -0.416329
C  -2.946229 0.150447 -0.566855
C  -1.89671 -2.255186 -1.470339
C  -3.530684 -0.510142 -1.637767
C  -3.017888 -1.715927 -2.087747
C  -0.925262 -4.39168 -1.134336
C  0.174079 -5.117382 -1.571983
C  -1.533447 -4.689566 0.079566
C  0.667967 -6.149379 -0.787002
C  -1.020447 -5.716459 0.858872
C  0.079421 -6.449543 0.433763
H  0.817955 4.789913 0.319664
H  2.135373 2.005454 0.149434
H  -0.501934 4.284772 -1.629897
H  0.649474 4.700313 -2.886493
H  0.021054 3.059987 -2.786782
H  2.573303 2.429914 -2.829627
H  3.106134 4.100461 -2.670935
H  3.600705 2.899074 -1.479657
H  3.693611 5.005797 -0.131881
H  1.423673 3.754895 2.58026
H  2.844953 3.05177 3.351571
H  2.349767 4.678767 3.759851
H  5.213185 4.14898 2.821197
H  5.299799 5.330648 1.51211
H  4.591925 5.765926 3.070571
H  -1.848419 1.086614 1.592006
H  -0.398648 -2.009091 0.049463
H  -3.363619 1.082504 -0.208802
H  -4.404146 -0.090106 -2.118659
H  -3.483416 -2.240975 -2.912351
H  0.635096 -4.877999 -2.522287
H  -2.399272 -4.135831 0.420668
H  1.524232 -6.714104 -1.132872
H  -1.492392 -5.945491 1.8058
H  0.472077 -7.249243 1.047819
elementType: O N C H
totalener: -1210.10599949 hartree
nucrepener: 2447.24040140 hartree
electener: -3657.34640089 hartree
oneelecener: -6506.02601148 hartree
twoeener: 2848.67961058 hartree
cpcmener: -0.02794938 hartree
kineticenergy: 1204.70626728 hartree
xcener: -118.581709359415 hartree
chargesum: 0.0000000
charge: -0.286703 -0.459540 -0.328226 -0.090770 0.147379 -0.013849 -0.111014 -0.281020 -0.286091 -0.295106 0.399014 -0.009219 -0.241737 -0.227303 0.417763 0.018884 -0.231327 -0.192974 -0.179615 0.229840 -0.122741 -0.221625 0.281505 -0.248989 -0.186688 -0.120464 -0.145332 -0.186824 0.106487 0.094025 0.094577 0.095208 0.101053 0.098143 0.099468 0.093665 0.121628 0.081405 0.100547 0.100650 0.093843 0.089326 0.096306 0.133251 0.143667 0.144544 0.158785 0.148619 0.146275 0.155378 0.158021 0.159550 0.158352
qa: -0.2867 -0.4595 -0.3282 -0.0908 0.1474 -0.0138 -0.1110 -0.2810 -0.2861 -0.2951 0.3990 -0.0092 -0.2417 -0.2273 0.4178 0.0189 -0.2313 -0.1930 -0.1796 0.2298 -0.1227 -0.2216 0.2815 -0.2490 -0.1867 -0.1205 -0.1453 -0.1868 0.1065 0.0940 0.0946 0.0952 0.1011 0.0981 0.0995 0.0937 0.1216 0.0814 0.1005 0.1007 0.0938 0.0893 0.0963 0.1333 0.1437 0.1445 0.1588 0.1486 0.1463 0.1554 0.1580 0.1595 0.1584
va: 2.1182 2.0486 2.0808 3.1080 3.7020 3.8154 3.8233 3.8929 3.9106 3.8909 4.1477 3.7076 3.9379 3.9313 3.7263 3.6297 4.0790 3.9822 3.9341 3.7836 3.9084 4.0126 3.6972 4.0085 3.8956 3.8865 3.8966 3.9082 1.0229 1.0311 1.0171 1.0014 0.9986 1.0029 0.9996 1.0020 1.0039 1.0130 0.9982 0.9998 0.9965 1.0063 0.9965 1.0232 1.0105 1.0111 0.9897 1.0044 1.0079 0.9975 0.9890 0.9902 0.9904
dispcorr: -0.025315882 hartree
energy: -1210.131315369053
dipole: 21.44474 -21.05269 0.39205 26.91969 -26.22552 0.69417 -0.82508 -0.18971 -1.01479
magnitude: 1.29049 au
magnitude: 3.28017 debye
