program: Orca
programVersion: 5.0.2
elementType: O O O N C C C C C C C C C C C C C C C C C C C C C C C C H H H H H H H H H H H H H H H H H H H H H H H H H
charge: 0
multiplicity: 1
keywords: wb97x-d3
keywords: def2-TZVPP
keywords: def2/J RIJCOSX
keywords: DEFGRID2
keywords: scfconv7
keywords: smallprint printgap noloewdin
keywords: NOSOSCF
formula: C24H25NO3
InChI: InChI=1/C24H25NO3/c1-16(2)13-20-22(24(20,3)4)23(26)28-21(15-25)17-9-8-12-19(14-17)27-18-10-6-5-7-11-18/h5-14,20-22H,1-4H3
53 atoms
O  -0.145648 0.705946 0.9452
O  -0.933339 2.713442 0.34717
O  -1.866587 -3.277534 -2.008267
N  -1.096889 -1.320448 3.372908
C  1.819947 3.022684 -1.113691
C  2.001867 3.582609 0.261834
C  1.396582 2.192007 0.084766
C  0.795748 3.671055 -2.01299
C  3.010307 2.491109 -1.876744
C  3.317291 3.695768 0.919777
C  -0.006408 1.950804 0.446059
C  3.734979 4.685425 1.71677
C  2.925157 5.888347 2.093537
C  5.105624 4.646441 2.324436
C  -1.445355 0.295673 1.348589
C  -2.186229 -0.391051 0.227967
C  -1.23404 -0.617478 2.474971
C  -1.645944 -1.537622 -0.34737
C  -3.385739 0.133816 -0.226434
C  -2.33356 -2.167575 -1.373865
C  -4.056476 -0.502496 -1.263392
C  -3.541012 -1.651581 -1.834972
C  -1.029559 -4.144758 -1.351735
C  -1.411294 -4.745094 -0.158424
C  0.182295 -4.452636 -1.949397
C  -0.559442 -5.66311 0.437488
C  1.020807 -5.381558 -1.347489
C  0.65683 -5.984481 -0.151989
H  1.274334 4.343846 0.522391
H  2.05965 1.366757 0.317913
H  1.288959 4.426568 -2.628163
H  0.343055 2.943318 -2.689436
H  -0.002938 4.16922 -1.468912
H  2.680044 1.808743 -2.662371
H  3.555419 3.30745 -2.354722
H  3.713627 1.945766 -1.248719
H  4.00751 2.876821 0.740187
H  2.669439 5.862683 3.15693
H  3.504122 6.802787 1.941035
H  1.996873 5.991332 1.534441
H  5.053312 4.703464 3.415203
H  5.649527 3.738668 2.062637
H  5.703489 5.502738 2.000536
H  -2.031437 1.140588 1.722641
H  -0.700787 -1.932918 0.006873
H  -3.79688 1.02793 0.224215
H  -4.994586 -0.102537 -1.624819
H  -4.067435 -2.153626 -2.637094
H  -2.364069 -4.506722 0.298463
H  0.462276 -3.976647 -2.880813
H  -0.853976 -6.134563 1.366242
H  1.965534 -5.627124 -1.815192
H  1.314126 -6.704959 0.316802
elementType: O N C H
totalener: -1210.10749045 hartree
nucrepener: 2434.06118145 hartree
electener: -3644.16867190 hartree
oneelecener: -6479.71250199 hartree
twoeener: 2835.54383009 hartree
cpcmener: -0.02981843 hartree
kineticenergy: 1204.69434522 hartree
xcener: -118.579489710935 hartree
chargesum: -0.0000000
charge: -0.291418 -0.454114 -0.326955 -0.090974 0.104434 0.035418 -0.101674 -0.275929 -0.271530 -0.267539 0.400471 -0.048153 -0.255747 -0.216939 0.421791 0.012242 -0.231612 -0.193605 -0.196399 0.243452 -0.114873 -0.229007 0.250772 -0.177543 -0.223894 -0.144811 -0.133655 -0.171222 0.098404 0.088735 0.096056 0.099074 0.093147 0.097580 0.097889 0.089124 0.115749 0.100167 0.093047 0.091250 0.092379 0.087888 0.094174 0.135556 0.143980 0.145476 0.158154 0.147870 0.158021 0.147943 0.159695 0.158426 0.159229
qa: -0.2914 -0.4541 -0.3270 -0.0910 0.1044 0.0354 -0.1017 -0.2759 -0.2715 -0.2675 0.4005 -0.0482 -0.2557 -0.2169 0.4218 0.0122 -0.2316 -0.1936 -0.1964 0.2435 -0.1149 -0.2290 0.2508 -0.1775 -0.2239 -0.1448 -0.1337 -0.1712 0.0984 0.0887 0.0961 0.0991 0.0931 0.0976 0.0979 0.0891 0.1157 0.1002 0.0930 0.0912 0.0924 0.0879 0.0942 0.1356 0.1440 0.1455 0.1582 0.1479 0.1580 0.1479 0.1597 0.1584 0.1592
va: 2.1225 2.0584 2.0809 3.1097 3.6871 3.7940 3.8426 3.9014 3.9134 3.8871 4.1731 3.7639 3.9400 3.9207 3.7198 3.6445 4.0834 3.9398 3.9538 3.7739 3.9081 4.0021 3.7155 3.9290 4.0071 3.8919 3.8884 3.8963 1.0252 1.0366 0.9998 0.9997 1.0193 1.0016 1.0014 1.0067 1.0123 0.9954 0.9980 1.0100 0.9961 1.0093 0.9963 1.0217 1.0165 1.0055 0.9897 1.0058 0.9963 1.0060 0.9900 0.9895 0.9900
dispcorr: -0.024152304 hartree
energy: -1210.131642753982
dipole: 26.38479 -25.63158 0.75321 28.71967 -28.02464 0.69503 -2.30919 1.22536 -1.08383
magnitude: 1.49167 au
magnitude: 3.79151 debye
