program: Orca
programVersion: 5.0.2
elementType: O O O N C C C C C C C C C C C C C C C C C C C C C C C C H H H H H H H H H H H H H H H H H H H H H H H H H
charge: 0
multiplicity: 1
keywords: wb97x-d3
keywords: def2-TZVPP
keywords: def2/J RIJCOSX
keywords: DEFGRID2
keywords: scfconv7
keywords: smallprint printgap noloewdin
keywords: NOSOSCF
formula: C24H25NO3
InChI: InChI=1/C24H25NO3/c1-16(2)13-20-22(24(20,3)4)23(26)28-21(15-25)17-9-8-12-19(14-17)27-18-10-6-5-7-11-18/h5-14,20-22H,1-4H3
53 atoms
O  0.021029 0.781979 0.991861
O  -0.879908 2.662139 0.185258
O  -1.35651 -3.322705 -2.018722
N  -0.980631 -1.347206 3.307886
C  1.919662 3.078572 -1.136723
C  1.928237 3.799837 0.173527
C  1.495248 2.338994 0.121999
C  0.903521 3.491707 -2.173853
C  3.219623 2.615721 -1.751005
C  3.164225 4.142761 0.901666
C  0.097534 1.993437 0.407804
C  3.401143 5.263896 1.591548
C  2.435706 6.399031 1.748235
C  4.709103 5.462201 2.297446
C  -1.281496 0.294487 1.297825
C  -1.902359 -0.398648 0.110279
C  -1.096458 -0.624776 2.422873
C  -1.332486 -1.568711 -0.377293
C  -3.00672 0.16176 -0.516711
C  -1.893708 -2.186607 -1.484937
C  -3.546035 -0.459099 -1.633968
C  -2.998866 -1.635897 -2.119304
C  -1.006412 -4.355354 -1.189391
C  0.139174 -5.068492 -1.512812
C  -1.785386 -4.720077 -0.097519
C  0.505157 -6.158804 -0.736019
C  -1.400243 -5.805418 0.676104
C  -0.256846 -6.528648 0.363674
H  1.101444 4.491149 0.294495
H  2.217964 1.621122 0.493123
H  1.360101 4.212819 -2.854903
H  0.579668 2.637747 -2.772339
H  0.01932 3.962915 -1.751376
H  3.033336 1.823839 -2.478953
H  3.708431 3.438884 -2.276131
H  3.924499 2.223895 -1.018996
H  3.951539 3.395024 0.878392
H  2.129404 6.501286 2.793031
H  2.9098 7.344962 1.474678
H  1.532608 6.299437 1.149281
H  5.230375 6.345471 1.91838
H  4.555777 5.631424 3.366954
H  5.374287 4.605939 2.185752
H  -1.933302 1.10097 1.648094
H  -0.461078 -1.999515 0.10371
H  -3.445277 1.074957 -0.136281
H  -4.406953 -0.027779 -2.127269
H  -3.424507 -2.128489 -2.984486
H  0.73603 -4.773662 -2.366958
H  -2.686297 -4.172958 0.151134
H  1.398604 -6.714658 -0.989887
H  -2.006474 -6.088228 1.527087
H  0.035915 -7.374877 0.971062
elementType: O N C H
totalener: -1210.10768548 hartree
nucrepener: 2428.71415586 hartree
electener: -3638.82184134 hartree
oneelecener: -6469.04565943 hartree
twoeener: 2830.22381809 hartree
cpcmener: -0.02979099 hartree
kineticenergy: 1204.70516018 hartree
xcener: -118.582000141125 hartree
chargesum: -0.0000000
charge: -0.287731 -0.456402 -0.331090 -0.089884 0.101817 0.037372 -0.096177 -0.275171 -0.272438 -0.271684 0.403129 -0.048224 -0.252907 -0.216843 0.425587 0.007822 -0.234104 -0.170109 -0.174959 0.201257 -0.127171 -0.211302 0.261397 -0.239059 -0.169014 -0.125923 -0.152262 -0.181275 0.097496 0.088899 0.096383 0.099063 0.093241 0.097935 0.098061 0.088808 0.116735 0.098791 0.093905 0.089900 0.094064 0.092493 0.087595 0.137062 0.147384 0.144651 0.158689 0.149512 0.146469 0.154214 0.157024 0.158979 0.157995
qa: -0.2877 -0.4564 -0.3311 -0.0899 0.1018 0.0374 -0.0962 -0.2752 -0.2724 -0.2717 0.4031 -0.0482 -0.2529 -0.2168 0.4256 0.0078 -0.2341 -0.1701 -0.1750 0.2013 -0.1272 -0.2113 0.2614 -0.2391 -0.1690 -0.1259 -0.1523 -0.1813 0.0975 0.0889 0.0964 0.0991 0.0932 0.0979 0.0981 0.0888 0.1167 0.0988 0.0939 0.0899 0.0941 0.0925 0.0876 0.1371 0.1474 0.1447 0.1587 0.1495 0.1465 0.1542 0.1570 0.1590 0.1580
va: 2.1294 2.0566 2.0708 3.1099 3.6899 3.7909 3.8467 3.9022 3.9136 3.8865 4.1659 3.7675 3.9405 3.9208 3.7257 3.6015 4.0759 3.9595 3.9428 3.7957 3.9090 4.0081 3.7105 4.0010 3.8813 3.8926 3.9031 3.9005 1.0263 1.0361 0.9998 0.9996 1.0189 1.0015 1.0013 1.0069 1.0119 0.9960 0.9978 1.0104 0.9963 0.9961 1.0092 1.0176 1.0109 1.0096 0.9897 1.0034 1.0075 0.9980 0.9893 0.9906 0.9902
dispcorr: -0.024367235 hartree
energy: -1210.132052711574
dipole: 23.48518 -22.99520 0.48997 30.66128 -29.74951 0.91177 -2.53677 1.52152 -1.01525
magnitude: 1.44987 au
magnitude: 3.68529 debye
