program: Orca
programVersion: 5.0.2
elementType: O O O N C C C C C C C C C C C C C C C C C C C C C C C C H H H H H H H H H H H H H H H H H H H H H H H H H
charge: 0
multiplicity: 1
keywords: wb97x-d3
keywords: def2-TZVPP
keywords: def2/J RIJCOSX
keywords: DEFGRID2
keywords: scfconv7
keywords: smallprint printgap noloewdin
keywords: NOSOSCF
formula: C24H25NO3
InChI: InChI=1/C24H25NO3/c1-16(2)13-20-22(24(20,3)4)23(26)28-21(15-25)17-9-8-12-19(14-17)27-18-10-6-5-7-11-18/h5-14,20-22H,1-4H3
53 atoms
O  0.01229 0.745387 1.032613
O  -0.842383 2.623158 0.172623
O  -1.40584 -3.305484 -2.03523
N  -1.065734 -1.391237 3.308552
C  2.007898 2.938811 -1.091559
C  1.970948 3.73309 0.175751
C  1.53089 2.274871 0.190474
C  1.031256 3.294588 -2.186137
C  3.32862 2.439543 -1.626203
C  3.179928 4.111421 0.932183
C  0.120337 1.948171 0.436225
C  3.411613 5.283022 1.534358
C  2.473086 6.451195 1.533422
C  4.68527 5.51231 2.292089
C  -1.303596 0.28096 1.314808
C  -1.927188 -0.393392 0.117649
C  -1.15151 -0.658246 2.428599
C  -1.359348 -1.557597 -0.386147
C  -3.040973 0.168172 -0.490561
C  -1.933984 -2.170946 -1.489532
C  -3.592355 -0.446392 -1.605534
C  -3.048699 -1.618471 -2.105742
C  -1.014599 -4.327203 -1.210055
C  0.139012 -5.017225 -1.553773
C  -1.762767 -4.70217 -0.100209
C  0.545315 -6.094037 -0.777916
C  -1.337046 -5.77253 0.672598
C  -0.184003 -6.471772 0.341018
H  1.145399 4.434739 0.224809
H  2.233441 1.573863 0.627081
H  0.733127 2.410089 -2.752951
H  0.130098 3.780471 -1.819452
H  1.50947 3.984247 -2.884719
H  4.006119 2.10084 -0.843558
H  3.170156 1.600059 -2.305854
H  3.835947 3.22749 -2.186649
H  3.947436 3.347247 1.014779
H  1.592778 6.313093 0.907927
H  2.128047 6.668191 2.548449
H  2.98603 7.351791 1.185115
H  4.478841 5.780765 3.331853
H  5.330044 4.63341 2.295214
H  5.252247 6.344846 1.866724
H  -1.944141 1.095899 1.666673
H  -0.4814 -1.988967 0.082166
H  -3.478164 1.0764 -0.096788
H  -4.461207 -0.014676 -2.084371
H  -3.485464 -2.107047 -2.967681
H  0.71064 -4.715452 -2.422622
H  -2.669948 -4.172898 0.163857
H  1.445944 -6.631005 -1.046626
H  -1.918323 -6.062702 1.538357
H  0.141231 -7.306236 0.948146
elementType: O N C H
totalener: -1210.10780588 hartree
nucrepener: 2431.82198395 hartree
electener: -3641.92978984 hartree
oneelecener: -6475.27264873 hartree
twoeener: 2833.34285890 hartree
cpcmener: -0.02986841 hartree
kineticenergy: 1204.70091058 hartree
xcener: -118.581295966118 hartree
chargesum: -0.0000000
charge: -0.287895 -0.454649 -0.331203 -0.090378 0.100893 0.038517 -0.096224 -0.275494 -0.270873 -0.270615 0.399259 -0.049081 -0.252457 -0.216672 0.427999 0.008267 -0.234438 -0.172018 -0.178368 0.203005 -0.126167 -0.212050 0.260633 -0.238397 -0.169421 -0.126587 -0.151714 -0.180763 0.096316 0.089182 0.099085 0.094339 0.096480 0.088650 0.098071 0.097949 0.116307 0.089708 0.098003 0.094367 0.092366 0.087837 0.093784 0.138229 0.147674 0.144528 0.158370 0.149367 0.146933 0.154810 0.157377 0.159052 0.158111
qa: -0.2879 -0.4546 -0.3312 -0.0904 0.1009 0.0385 -0.0962 -0.2755 -0.2709 -0.2706 0.3993 -0.0491 -0.2525 -0.2167 0.4280 0.0083 -0.2344 -0.1720 -0.1784 0.2030 -0.1262 -0.2121 0.2606 -0.2384 -0.1694 -0.1266 -0.1517 -0.1808 0.0963 0.0892 0.0991 0.0943 0.0965 0.0886 0.0981 0.0979 0.1163 0.0897 0.0980 0.0944 0.0924 0.0878 0.0938 0.1382 0.1477 0.1445 0.1584 0.1494 0.1469 0.1548 0.1574 0.1591 0.1581
va: 2.1290 2.0593 2.0721 3.1099 3.6930 3.7871 3.8469 3.9023 3.9124 3.8846 4.1706 3.7678 3.9412 3.9211 3.7227 3.5946 4.0761 3.9532 3.9450 3.7954 3.9091 4.0070 3.7121 4.0023 3.8825 3.8923 3.9025 3.9004 1.0275 1.0363 0.9994 1.0184 1.0000 1.0066 1.0016 1.0015 1.0120 1.0102 0.9963 0.9976 0.9961 1.0091 0.9965 1.0167 1.0112 1.0090 0.9898 1.0035 1.0072 0.9976 0.9892 0.9906 0.9901
dispcorr: -0.024439046 hartree
energy: -1210.132244927853
dipole: 24.10165 -23.55301 0.54864 30.38325 -29.47043 0.91282 -2.70228 1.71944 -0.98284
magnitude: 1.44922 au
magnitude: 3.68361 debye
