program: Orca
programVersion: 5.0.2
elementType: O O O N C C C C C C C C C C C C C C C C C C C C C C C C H H H H H H H H H H H H H H H H H H H H H H H H H
charge: 0
multiplicity: 1
keywords: wb97x-d3
keywords: def2-TZVPP
keywords: def2/J RIJCOSX
keywords: DEFGRID2
keywords: scfconv7
keywords: smallprint printgap noloewdin
keywords: NOSOSCF
formula: C24H25NO3
InChI: InChI=1/C24H25NO3/c1-16(2)13-20-22(24(20,3)4)23(26)28-21(15-25)17-9-8-12-19(14-17)27-18-10-6-5-7-11-18/h5-14,20-22H,1-4H3
53 atoms
O  -1.011077 1.570576 -0.509449
O  -1.409204 3.620209 -1.303114
O  -1.076334 -3.446099 -0.201138
N  -3.229393 2.176856 1.931341
C  1.595516 3.216149 0.349261
C  1.828367 1.949262 -0.426497
C  0.839647 2.968037 -0.944556
C  0.865777 3.114449 1.667529
C  2.616841 4.325997 0.322643
C  3.064655 1.693032 -1.190925
C  -0.622511 2.781215 -0.947759
C  3.725827 0.53309 -1.267786
C  3.322429 -0.734394 -0.576651
C  4.967627 0.41515 -2.10039
C  -2.395425 1.31769 -0.3969
C  -2.666849 -0.164347 -0.526191
C  -2.85714 1.8053 0.910016
C  -1.683683 -1.106928 -0.256642
C  -3.941689 -0.557483 -0.911841
C  -1.994916 -2.456537 -0.37908
C  -4.235057 -1.907244 -1.024951
C  -3.268055 -2.861663 -0.757466
C  -0.034628 -3.305373 0.67616
C  1.208703 -3.753941 0.254575
C  -0.213276 -2.808973 1.9618
C  2.283033 -3.710128 1.131923
C  0.873389 -2.757822 2.822739
C  2.122796 -3.206685 2.415195
H  1.38196 1.074672 0.031627
H  1.163331 3.587336 -1.774978
H  0.217969 2.240831 1.733501
H  1.586007 3.040337 2.484709
H  0.255666 4.001735 1.849723
H  3.081123 4.4563 -0.654053
H  2.15134 5.276519 0.590757
H  3.41219 4.133096 1.045769
H  3.46097 2.533817 -1.753149
H  4.159348 -1.141405 -0.003753
H  2.483772 -0.620301 0.107184
H  3.051255 -1.499833 -1.30877
H  5.215099 1.347086 -2.609022
H  5.826292 0.12846 -1.487094
H  4.85956 -0.363749 -2.860286
H  -2.962059 1.853068 -1.164772
H  -0.686472 -0.800794 0.030844
H  -4.700266 0.184946 -1.126935
H  -5.225683 -2.220384 -1.326742
H  -3.491864 -3.916861 -0.850598
H  1.330945 -4.14076 -0.7495
H  -1.186397 -2.472202 2.297185
H  3.251845 -4.0631 0.802674
H  0.735547 -2.37204 3.824584
H  2.963606 -3.168727 3.095186
elementType: O N C H
totalener: -1210.10453274 hartree
nucrepener: 2555.41419180 hartree
electener: -3765.51872453 hartree
oneelecener: -6721.59126059 hartree
twoeener: 2956.07253606 hartree
cpcmener: -0.03116089 hartree
kineticenergy: 1204.70117797 hartree
xcener: -118.584500741060 hartree
chargesum: -0.0000000
charge: -0.268638 -0.435476 -0.324514 -0.086222 0.089597 0.082602 -0.117940 -0.262972 -0.278380 -0.285214 0.401145 -0.047326 -0.246728 -0.222237 0.343342 0.040751 -0.220893 -0.196174 -0.222454 0.282237 -0.111356 -0.242390 0.307126 -0.265195 -0.205281 -0.132391 -0.137201 -0.168283 0.093792 0.096808 0.081961 0.098436 0.102790 0.088375 0.098266 0.097332 0.116444 0.095218 0.068624 0.100185 0.088446 0.094897 0.092845 0.138602 0.150089 0.145465 0.157898 0.147536 0.145457 0.156428 0.157518 0.159668 0.157380
qa: -0.2686 -0.4355 -0.3245 -0.0862 0.0896 0.0826 -0.1179 -0.2630 -0.2784 -0.2852 0.4011 -0.0473 -0.2467 -0.2222 0.3433 0.0408 -0.2209 -0.1962 -0.2225 0.2822 -0.1114 -0.2424 0.3071 -0.2652 -0.2053 -0.1324 -0.1372 -0.1683 0.0938 0.0968 0.0820 0.0984 0.1028 0.0884 0.0983 0.0973 0.1164 0.0952 0.0686 0.1002 0.0884 0.0949 0.0928 0.1386 0.1501 0.1455 0.1579 0.1475 0.1455 0.1564 0.1575 0.1597 0.1574
va: 2.1373 2.0720 2.0880 3.1061 3.7210 3.7319 3.8407 3.9042 3.9099 3.8673 4.1996 3.8130 3.9392 3.9206 3.7469 3.7424 4.0146 3.9584 3.9808 3.7313 3.9006 4.0001 3.6561 3.9646 3.9278 3.8363 3.8806 3.8769 0.9988 1.0290 1.0119 1.0021 1.0016 1.0066 1.0013 1.0011 1.0104 0.9974 1.0063 0.9949 1.0090 0.9960 0.9960 1.0295 1.0027 1.0016 0.9891 1.0065 1.0099 0.9970 0.9902 0.9897 0.9906
dispcorr: -0.028181313 hartree
energy: -1210.132714049904
dipole: 30.49856 -28.97402 1.52454 6.49445 -7.78909 -1.29465 -0.10440 -0.58759 -0.69199
magnitude: 2.11641 au
magnitude: 5.37948 debye
