program: Orca
programVersion: 5.0.2
elementType: O O O N C C C C C C C C C C C C C C C C C C C C C C C C H H H H H H H H H H H H H H H H H H H H H H H H H
charge: 0
multiplicity: 1
keywords: wb97x-d3
keywords: def2-TZVPP
keywords: def2/J RIJCOSX
keywords: DEFGRID2
keywords: scfconv7
keywords: smallprint printgap noloewdin
keywords: NOSOSCF
formula: C24H25NO3
InChI: InChI=1/C24H25NO3/c1-16(2)13-20-22(24(20,3)4)23(26)28-21(15-25)17-9-8-12-19(14-17)27-18-10-6-5-7-11-18/h5-14,20-22H,1-4H3
53 atoms
O  -1.322441 2.08494 0.353871
O  0.347929 0.772693 1.035774
O  -1.242532 -3.686846 -0.830047
N  -2.425487 0.189589 2.935738
C  2.034053 3.427235 1.036216
C  2.220448 2.744609 -0.270775
C  0.805703 2.993109 0.248393
C  2.429003 2.705904 2.301499
C  2.230443 4.922083 1.123736
C  2.671697 3.439411 -1.502729
C  -0.019091 1.835558 0.601895
C  2.407204 3.019922 -2.743495
C  1.59307 1.79863 -3.04306
C  2.901655 3.766648 -3.943872
C  -2.221105 0.992022 0.455509
C  -1.910256 -0.09785 -0.549103
C  -2.301649 0.519798 1.842753
C  -1.729964 -1.418896 -0.17018
C  -1.799183 0.271105 -1.885669
C  -1.410142 -2.369093 -1.132513
C  -1.487583 -0.689433 -2.83478
C  -1.282348 -2.009838 -2.46641
C  -0.752128 -4.059207 0.3946
C  0.372893 -3.459023 0.947194
C  -1.389653 -5.106195 1.042836
C  0.850295 -3.914241 2.16724
C  -0.892466 -5.559821 2.256765
C  0.222767 -4.963017 2.826978
H  2.522609 1.703382 -0.189776
H  0.263759 3.798948 -0.232632
H  1.790864 3.00003 3.137008
H  2.387147 1.623028 2.210645
H  3.45513 2.970685 2.564609
H  1.69069 5.327122 1.981682
H  3.28716 5.163843 1.25615
H  1.877279 5.448403 0.236958
H  3.264353 4.340729 -1.37528
H  0.688074 2.067303 -3.595272
H  2.149226 1.109887 -3.684459
H  1.289455 1.250313 -2.152919
H  3.47826 4.650884 -3.672316
H  3.532645 3.131474 -4.571174
H  2.067638 4.088893 -4.573432
H  -3.198085 1.42549 0.225099
H  -1.826622 -1.710154 0.868418
H  -1.947859 1.299419 -2.189876
H  -1.39324 -0.405973 -3.874849
H  -1.028019 -2.758448 -3.206019
H  0.873879 -2.644094 0.438794
H  -2.264419 -5.56401 0.598027
H  1.724508 -3.445618 2.600466
H  -1.389066 -6.378501 2.761438
H  0.603544 -5.313673 3.777153
elementType: O N C H
totalener: -1210.10396730 hartree
nucrepener: 2542.59472147 hartree
electener: -3752.69868877 hartree
oneelecener: -6697.36557441 hartree
twoeener: 2944.66688564 hartree
cpcmener: -0.03115778 hartree
kineticenergy: 1204.71669730 hartree
xcener: -118.587625233919 hartree
chargesum: -0.0000000
charge: -0.291007 -0.452268 -0.326217 -0.078661 0.159479 -0.030728 -0.068742 -0.276220 -0.289697 -0.294400 0.375642 0.006421 -0.251390 -0.228544 0.508139 -0.018310 -0.265532 -0.177071 -0.311202 0.279929 -0.098737 -0.235298 0.273083 -0.186076 -0.241796 -0.139445 -0.122178 -0.180457 0.108150 0.089462 0.100318 0.094040 0.094638 0.098559 0.101196 0.091779 0.123239 0.098410 0.102505 0.076266 0.089680 0.095598 0.094789 0.144505 0.134913 0.146210 0.158817 0.146478 0.154171 0.144938 0.158719 0.157043 0.156859
qa: -0.2910 -0.4523 -0.3262 -0.0787 0.1595 -0.0307 -0.0687 -0.2762 -0.2897 -0.2944 0.3756 0.0064 -0.2514 -0.2285 0.5081 -0.0183 -0.2655 -0.1771 -0.3112 0.2799 -0.0987 -0.2353 0.2731 -0.1861 -0.2418 -0.1394 -0.1222 -0.1805 0.1082 0.0895 0.1003 0.0940 0.0946 0.0986 0.1012 0.0918 0.1232 0.0984 0.1025 0.0763 0.0897 0.0956 0.0948 0.1445 0.1349 0.1462 0.1588 0.1465 0.1542 0.1449 0.1587 0.1570 0.1569
va: 2.1199 2.0462 2.0845 3.1077 3.7182 3.8305 3.8179 3.8858 3.9111 3.8918 4.1190 3.7109 3.9468 3.9287 3.8110 3.6882 4.1045 3.8659 3.9593 3.7840 3.8597 4.0179 3.6998 3.9121 4.0117 3.8893 3.8817 3.9049 1.0210 1.0343 0.9996 1.0192 1.0009 1.0030 0.9987 1.0016 1.0043 0.9966 1.0002 1.0083 1.0066 0.9963 0.9961 0.9899 1.0166 1.0086 0.9888 1.0061 1.0020 1.0079 0.9905 0.9894 0.9908
dispcorr: -0.027792899 hartree
energy: -1210.131760196988
dipole: 22.54998 -22.11035 0.43963 22.72202 -21.21819 1.50382 -9.96089 7.91258 -2.04831
magnitude: 2.57883 au
magnitude: 6.55486 debye
