program: Orca
programVersion: 5.0.2
elementType: O O O N C C C C C C C C C C C C C C C C C C C C C C C C H H H H H H H H H H H H H H H H H H H H H H H H H
charge: 0
multiplicity: 1
keywords: wb97x-d3
keywords: def2-TZVPP
keywords: def2/J RIJCOSX
keywords: DEFGRID2
keywords: scfconv7
keywords: smallprint printgap noloewdin
keywords: NOSOSCF
formula: C24H25NO3
InChI: InChI=1/C24H25NO3/c1-16(2)13-20-22(24(20,3)4)23(26)28-21(15-25)17-9-8-12-19(14-17)27-18-10-6-5-7-11-18/h5-14,20-22H,1-4H3
53 atoms
O  -1.026939 1.815946 0.158952
O  -1.45159 2.3899 -1.952932
O  -0.940742 -3.261898 -0.591718
N  -2.843897 1.353566 2.868785
C  1.480876 3.539931 -0.050615
C  1.836853 2.104518 -0.277641
C  0.730875 2.747662 -1.110273
C  0.832037 3.920145 1.259273
C  2.376833 4.633599 -0.585113
C  3.081058 1.675047 -0.942104
C  -0.672618 2.317979 -1.035742
C  3.738773 0.528532 -0.736558
C  3.307611 -0.562379 0.194344
C  5.007461 0.232642 -1.479432
C  -2.365382 1.374257 0.298591
C  -2.595111 -0.008458 -0.269904
C  -2.616457 1.367449 1.743102
C  -1.610416 -0.981621 -0.146055
C  -3.809714 -0.297311 -0.873633
C  -1.862551 -2.260491 -0.623847
C  -4.0436 -1.579295 -1.350519
C  -3.079594 -2.564255 -1.223538
C  -0.001101 -3.351254 0.399301
C  1.263046 -3.779437 0.019868
C  -0.295035 -3.10442 1.735151
C  2.243043 -3.957615 0.985841
C  0.699796 -3.27239 2.687813
C  1.970261 -3.695975 2.321043
H  1.473275 1.44099 0.498319
H  1.001798 3.001857 -2.12906
H  0.333796 3.091459 1.756346
H  1.60034 4.286138 1.943602
H  0.105819 4.724393 1.125921
H  2.765298 4.423782 -1.580937
H  1.827529 5.575222 -0.644333
H  3.228829 4.789623 0.079672
H  3.497311 2.365377 -1.669961
H  2.404575 -0.343463 0.761505
H  3.124357 -1.48134 -0.368034
H  4.099009 -0.796547 0.911358
H  5.836411 0.06154 -0.787114
H  4.91007 -0.680525 -2.073155
H  5.293733 1.041776 -2.151385
H  -3.068864 2.083514 -0.150056
H  -0.65988 -0.743846 0.315288
H  -4.567372 0.469956 -0.971116
H  -4.987433 -1.815302 -1.824019
H  -3.261146 -3.565473 -1.593679
H  1.474731 -3.975941 -1.023912
H  -1.285224 -2.788919 2.039359
H  3.227495 -4.293845 0.686766
H  0.471792 -3.076631 3.727687
H  2.738527 -3.827884 3.07145
elementType: O N C H
totalener: -1210.10460883 hartree
nucrepener: 2564.65436486 hartree
electener: -3774.75897369 hartree
oneelecener: -6740.35523546 hartree
twoeener: 2965.59626177 hartree
cpcmener: -0.03148837 hartree
kineticenergy: 1204.70038620 hartree
xcener: -118.584981853662 hartree
chargesum: -0.0000000
charge: -0.283766 -0.443850 -0.323900 -0.088676 0.110588 0.041217 -0.094245 -0.268669 -0.286088 -0.276768 0.397663 -0.031491 -0.272350 -0.221773 0.369396 0.043038 -0.229078 -0.211860 -0.221032 0.289749 -0.102396 -0.247391 0.324277 -0.272556 -0.207733 -0.145290 -0.144776 -0.159960 0.106209 0.089259 0.087873 0.095017 0.100530 0.091696 0.098433 0.099726 0.115787 0.084050 0.099127 0.101166 0.094032 0.092852 0.088658 0.143767 0.144069 0.143693 0.158693 0.147531 0.145302 0.155777 0.158289 0.158709 0.157478
qa: -0.2838 -0.4438 -0.3239 -0.0887 0.1106 0.0412 -0.0942 -0.2687 -0.2861 -0.2768 0.3977 -0.0315 -0.2723 -0.2218 0.3694 0.0430 -0.2291 -0.2119 -0.2210 0.2897 -0.1024 -0.2474 0.3243 -0.2726 -0.2077 -0.1453 -0.1448 -0.1600 0.1062 0.0893 0.0879 0.0950 0.1005 0.0917 0.0984 0.0997 0.1158 0.0840 0.0991 0.1012 0.0940 0.0929 0.0887 0.1438 0.1441 0.1437 0.1587 0.1475 0.1453 0.1558 0.1583 0.1587 0.1575
va: 2.1078 2.0678 2.0941 3.1078 3.6913 3.7599 3.8323 3.9127 3.9231 3.8774 4.1789 3.7949 3.9431 3.9191 3.7603 3.6190 4.0650 3.9602 3.9974 3.7284 3.8889 4.0044 3.6427 3.9598 3.9122 3.8427 3.8870 3.8686 1.0087 1.0305 1.0102 1.0000 1.0005 1.0071 1.0005 1.0003 1.0127 1.0092 0.9954 0.9973 0.9960 0.9968 1.0090 1.0202 1.0080 1.0026 0.9890 1.0063 1.0098 0.9974 0.9895 0.9903 0.9900
dispcorr: -0.028189859 hartree
energy: -1210.132798686548
dipole: 29.26769 -27.98496 1.28273 10.34933 -10.47382 -0.12449 -0.89518 0.49405 -0.40113
magnitude: 1.34974 au
magnitude: 3.43076 debye
