program: Orca
programVersion: 5.0.2
elementType: O O O N C C C C C C C C C C C C C C C C C C C C C C C C H H H H H H H H H H H H H H H H H H H H H H H H H
charge: 0
multiplicity: 1
keywords: wb97x-d3
keywords: def2-TZVPP
keywords: def2/J RIJCOSX
keywords: DEFGRID2
keywords: scfconv7
keywords: smallprint printgap noloewdin
keywords: NOSOSCF
formula: C24H25NO3
InChI: InChI=1/C24H25NO3/c1-16(2)13-20-22(24(20,3)4)23(26)28-21(15-25)17-9-8-12-19(14-17)27-18-10-6-5-7-11-18/h5-14,20-22H,1-4H3
53 atoms
O  -1.000247 1.543909 -1.093201
O  -1.174413 2.014861 1.080626
O  -0.917772 -3.265593 0.625988
N  -3.955054 3.082791 -0.474168
C  1.407066 3.723814 0.471966
C  1.811352 2.4554 1.136947
C  0.898954 2.39065 -0.072596
C  0.47189 4.665825 1.188504
C  2.397942 4.433073 -0.419281
C  3.199515 1.933683 1.037784
C  -0.499635 1.980771 0.083595
C  3.537321 0.655309 0.852706
C  2.543014 -0.45611 0.714115
C  4.97348 0.238976 0.760538
C  -2.346773 1.120729 -1.115219
C  -2.613695 -0.159685 -0.346191
C  -3.236042 2.220453 -0.715515
C  -1.596036 -1.098894 -0.218963
C  -3.884569 -0.431998 0.141012
C  -1.863974 -2.31203 0.403188
C  -4.133023 -1.645866 0.764786
C  -3.132379 -2.591283 0.896449
C  0.159868 -3.448424 -0.194782
C  1.342818 -3.836468 0.4204
C  0.084796 -3.340609 -1.578302
C  2.459982 -4.110309 -0.35432
C  1.215087 -3.604431 -2.339229
C  2.405567 -3.987097 -1.735905
H  1.303363 2.258901 2.079049
H  1.357037 2.075043 -1.002964
H  -0.168095 4.167832 1.913457
H  1.056033 5.411304 1.732006
H  -0.167412 5.201564 0.483937
H  1.87747 5.064555 -1.141896
H  3.05132 5.079922 0.170167
H  3.029818 3.743533 -0.979189
H  3.994969 2.667209 1.14056
H  2.785568 -1.269067 1.402383
H  1.517898 -0.149754 0.915621
H  2.576623 -0.884313 -0.291819
H  5.654407 1.087286 0.831157
H  5.230912 -0.46758 1.554002
H  5.171494 -0.273966 -0.184555
H  -2.553792 0.936775 -2.173962
H  -0.602504 -0.888982 -0.595053
H  -4.686602 0.288583 0.043892
H  -5.121764 -1.857362 1.149748
H  -3.325207 -3.538351 1.384306
H  1.383476 -3.928375 1.49868
H  -0.839936 -3.06161 -2.067294
H  3.379225 -4.414528 0.1297
H  1.156432 -3.51653 -3.416479
H  3.280419 -4.194307 -2.337889
elementType: O N C H
totalener: -1210.10335702 hartree
nucrepener: 2573.82227583 hartree
electener: -3783.92563286 hartree
oneelecener: -6759.07494561 hartree
twoeener: 2975.14931275 hartree
cpcmener: -0.03188615 hartree
kineticenergy: 1204.70299098 hartree
xcener: -118.587929541676 hartree
chargesum: -0.0000000
charge: -0.293416 -0.438161 -0.322045 -0.085392 0.144495 0.000379 -0.130857 -0.279715 -0.284281 -0.287896 0.387696 -0.004016 -0.250369 -0.232598 0.496174 -0.019412 -0.252507 -0.295653 -0.230004 0.362093 -0.093788 -0.262961 0.331291 -0.278311 -0.229984 -0.118321 -0.129604 -0.184721 0.108093 0.096851 0.095082 0.096105 0.100044 0.098283 0.099422 0.094008 0.121008 0.105441 0.083183 0.095415 0.090403 0.097044 0.093411 0.148395 0.140895 0.134704 0.159120 0.145480 0.145789 0.158770 0.157221 0.159948 0.157768
qa: -0.2934 -0.4382 -0.3220 -0.0854 0.1445 0.0004 -0.1309 -0.2797 -0.2843 -0.2879 0.3877 -0.0040 -0.2504 -0.2326 0.4962 -0.0194 -0.2525 -0.2957 -0.2300 0.3621 -0.0938 -0.2630 0.3313 -0.2783 -0.2300 -0.1183 -0.1296 -0.1847 0.1081 0.0969 0.0951 0.0961 0.1000 0.0983 0.0994 0.0940 0.1210 0.1054 0.0832 0.0954 0.0904 0.0970 0.0934 0.1484 0.1409 0.1347 0.1591 0.1455 0.1458 0.1588 0.1572 0.1599 0.1578
va: 2.1196 2.0680 2.0965 3.1030 3.7097 3.8031 3.8381 3.8980 3.9045 3.8888 4.1348 3.7359 3.9413 3.9294 3.7830 3.7939 4.1013 3.9907 3.9795 3.6580 3.9021 4.0260 3.6226 3.9547 3.9198 3.8411 3.8789 3.8997 1.0220 1.0319 1.0175 1.0011 1.0000 1.0030 1.0002 1.0026 1.0025 0.9971 1.0060 0.9960 1.0065 0.9967 0.9968 0.9858 1.0120 1.0161 0.9897 1.0079 1.0106 0.9955 0.9899 0.9895 0.9906
dispcorr: -0.029098147 hartree
energy: -1210.132455171971
dipole: 28.83594 -26.82548 2.01046 9.28408 -10.62259 -1.33851 1.93006 -3.35580 -1.42575
magnitude: 2.80470 au
magnitude: 7.12898 debye
