program: Orca
programVersion: 5.0.2
elementType: O O O N C C C C C C C C C C C C C C C C C C C C C C C C H H H H H H H H H H H H H H H H H H H H H H H H H
charge: 0
multiplicity: 1
keywords: wb97x-d3
keywords: def2-TZVPP
keywords: def2/J RIJCOSX
keywords: DEFGRID2
keywords: scfconv7
keywords: smallprint printgap noloewdin
keywords: NOSOSCF
formula: C24H25NO3
InChI: InChI=1/C24H25NO3/c1-16(2)13-20-22(24(20,3)4)23(26)28-21(15-25)17-9-8-12-19(14-17)27-18-10-6-5-7-11-18/h5-14,20-22H,1-4H3
53 atoms
O  -1.091765 1.928036 -0.690581
O  0.668039 0.551787 -0.701908
O  -2.074085 -3.816159 0.13889
N  -4.065335 2.043712 -2.113386
C  1.455942 2.470727 1.693746
C  2.332007 2.732701 0.506628
C  0.83646 2.714974 0.321364
C  1.44626 1.090241 2.302049
C  1.252494 3.571319 2.704234
C  3.060063 4.015612 0.332781
C  0.185646 1.614124 -0.402388
C  4.337432 4.220071 0.665122
C  5.210681 3.171697 1.28297
C  4.99801 5.545381 0.436455
C  -1.881448 0.892551 -1.259826
C  -2.213879 -0.178416 -0.245707
C  -3.099175 1.55557 -1.73106
C  -1.980859 -1.507879 -0.561006
C  -2.722966 0.180181 0.997153
C  -2.245246 -2.487937 0.38793
C  -2.993223 -0.810128 1.927772
C  -2.748478 -2.143042 1.634159
C  -1.038948 -4.264986 -0.635845
C  -1.301698 -5.355816 -1.452829
C  0.236356 -3.715629 -0.5734
C  -0.277516 -5.903721 -2.211215
C  1.247615 -4.267824 -1.347008
C  0.998811 -5.360061 -2.167353
H  2.841859 1.850505 0.129143
H  0.34708 3.677055 0.210903
H  0.466551 0.848008 2.719752
H  1.713921 0.306261 1.596797
H  2.168556 1.048267 3.119935
H  2.07452 3.583785 3.423302
H  1.201381 4.558667 2.246404
H  0.327597 3.415577 3.262854
H  2.501303 4.841637 -0.098353
H  6.06246 2.942765 0.636565
H  5.630757 3.530785 2.226262
H  4.68747 2.239073 1.489356
H  5.864066 5.444817 -0.223485
H  4.319535 6.27267 -0.009817
H  5.372642 5.964969 1.373883
H  -1.389724 0.452628 -2.133577
H  -1.589953 -1.769296 -1.536962
H  -2.908727 1.218466 1.242615
H  -3.390763 -0.543748 2.898151
H  -2.95035 -2.914905 2.366027
H  -2.29954 -5.775303 -1.487193
H  0.44937 -2.868734 0.067293
H  -0.484707 -6.756344 -2.845043
H  2.240266 -3.838812 -1.300225
H  1.794049 -5.784814 -2.765708
elementType: O N C H
totalener: -1210.10618815 hartree
nucrepener: 2469.00197985 hartree
electener: -3679.10816800 hartree
oneelecener: -6549.31318251 hartree
twoeener: 2870.20501451 hartree
cpcmener: -0.02977366 hartree
kineticenergy: 1204.71226465 hartree
xcener: -118.583129051330 hartree
chargesum: -0.0000000
charge: -0.278762 -0.442739 -0.326112 -0.087105 0.137660 -0.014134 -0.104406 -0.289177 -0.269794 -0.255631 0.370151 -0.035932 -0.248375 -0.228677 0.404450 0.032360 -0.226820 -0.203794 -0.243612 0.288710 -0.119952 -0.224827 0.296223 -0.255267 -0.200576 -0.117745 -0.143132 -0.188081 0.102860 0.095206 0.098317 0.094553 0.099390 0.097373 0.092454 0.099552 0.120476 0.100916 0.095173 0.086763 0.094895 0.089023 0.093616 0.137803 0.145200 0.146305 0.158565 0.148288 0.145655 0.158036 0.157741 0.158924 0.158009
qa: -0.2788 -0.4427 -0.3261 -0.0871 0.1377 -0.0141 -0.1044 -0.2892 -0.2698 -0.2556 0.3702 -0.0359 -0.2484 -0.2287 0.4044 0.0324 -0.2268 -0.2038 -0.2436 0.2887 -0.1200 -0.2248 0.2962 -0.2553 -0.2006 -0.1177 -0.1431 -0.1881 0.1029 0.0952 0.0983 0.0946 0.0994 0.0974 0.0925 0.0996 0.1205 0.1009 0.0952 0.0868 0.0949 0.0890 0.0936 0.1378 0.1452 0.1463 0.1586 0.1483 0.1457 0.1580 0.1577 0.1589 0.1580
va: 2.1242 2.0678 2.0871 3.1130 3.6807 3.8081 3.8599 3.9004 3.9028 3.8632 4.2268 3.7080 3.9389 3.9283 3.7358 3.5760 4.0772 3.9533 3.9661 3.7287 3.9013 4.0097 3.6858 4.0118 3.9101 3.8805 3.8949 3.9088 1.0217 1.0353 1.0010 1.0143 1.0024 1.0018 1.0023 1.0032 1.0068 0.9982 0.9981 1.0083 0.9952 1.0078 0.9966 1.0190 1.0062 1.0124 0.9893 1.0051 1.0086 0.9971 0.9890 0.9905 0.9905
dispcorr: -0.026232337 hartree
energy: -1210.132420484722
dipole: 32.84765 -30.94819 1.89946 20.40993 -20.33222 0.07771 15.65401 -14.42555 1.22846
magnitude: 2.26343 au
magnitude: 5.75317 debye
