program: Orca
programVersion: 5.0.2
elementType: O O O N C C C C C C C C C C C C C C C C C C C C C C C C H H H H H H H H H H H H H H H H H H H H H H H H H
charge: 0
multiplicity: 1
keywords: wb97x-d3
keywords: def2-TZVPP
keywords: def2/J RIJCOSX
keywords: DEFGRID2
keywords: scfconv7
keywords: smallprint printgap noloewdin
keywords: NOSOSCF
formula: C24H25NO3
InChI: InChI=1/C24H25NO3/c1-16(2)13-20-22(24(20,3)4)23(26)28-21(15-25)17-9-8-12-19(14-17)27-18-10-6-5-7-11-18/h5-14,20-22H,1-4H3
53 atoms
O  -1.112182 2.014476 -0.586288
O  0.583328 0.568359 -0.746513
O  -2.147932 -3.726624 -0.156976
N  -4.115933 2.393063 -1.878066
C  1.454226 2.260554 1.795437
C  2.362266 2.532972 0.634008
C  0.872375 2.634359 0.436429
C  1.337199 0.848865 2.31466
C  1.318855 3.30727 2.872236
C  3.187964 3.76513 0.55637
C  0.155344 1.624068 -0.355606
C  4.479003 3.840399 0.890551
C  5.269965 2.679156 1.409521
C  5.241662 5.124227 0.768686
C  -1.96232 1.066734 -1.220854
C  -2.316937 -0.073412 -0.294304
C  -3.160553 1.824576 -1.589796
C  -2.066743 -1.377013 -0.692522
C  -2.856229 0.195248 0.9589
C  -2.344084 -2.420685 0.182096
C  -3.145375 -0.857288 1.81175
C  -2.882712 -2.165986 1.434466
C  -1.037702 -4.110066 -0.859004
C  0.208791 -3.524094 -0.672628
C  -1.196627 -5.171424 -1.739469
C  1.295353 -4.007267 -1.388392
C  -0.09848 -5.650416 -2.438273
C  1.150315 -5.06786 -2.272071
H  2.811961 1.642036 0.204577
H  0.449748 3.6323 0.383011
H  0.336454 0.651522 2.705456
H  1.560216 0.093336 1.563621
H  2.042364 0.704173 3.135753
H  2.133557 3.218056 3.594431
H  1.340518 4.322621 2.477224
H  0.380256 3.181931 3.415651
H  2.693717 4.665389 0.202047
H  6.112005 2.454569 0.749264
H  5.701765 2.916144 2.385487
H  4.681921 1.769748 1.522679
H  6.096073 5.011969 0.095624
H  4.622734 5.938407 0.391585
H  5.650611 5.430805 1.735159
H  -1.514381 0.684782 -2.143889
H  -1.650838 -1.571085 -1.673846
H  -3.053149 1.213541 1.270793
H  -3.569772 -0.659622 2.787122
H  -3.096843 -2.987268 2.10657
H  0.343501 -2.701183 0.01836
H  -2.173364 -5.620107 -1.870771
H  2.265305 -3.548719 -1.245825
H  -0.225524 -6.479425 -3.122412
H  2.003605 -5.438311 -2.824633
elementType: O N C H
totalener: -1210.10609753 hartree
nucrepener: 2479.66203503 hartree
electener: -3689.76813255 hartree
oneelecener: -6570.63107343 hartree
twoeener: 2880.86294088 hartree
cpcmener: -0.02978911 hartree
kineticenergy: 1204.71032907 hartree
xcener: -118.582678741793 hartree
chargesum: -0.0000000
charge: -0.276241 -0.441444 -0.326982 -0.088650 0.143192 -0.013148 -0.107365 -0.288696 -0.269483 -0.259363 0.369402 -0.033779 -0.248405 -0.228570 0.407603 0.035980 -0.225500 -0.203224 -0.242757 0.279889 -0.121543 -0.220636 0.293329 -0.194375 -0.253121 -0.149752 -0.119206 -0.186580 0.101263 0.095600 0.098547 0.091462 0.100113 0.097320 0.092220 0.099319 0.120527 0.099863 0.095569 0.086644 0.094531 0.089190 0.093442 0.136348 0.146394 0.146350 0.159257 0.148636 0.157619 0.145412 0.158477 0.157630 0.157691
qa: -0.2762 -0.4414 -0.3270 -0.0887 0.1432 -0.0131 -0.1074 -0.2887 -0.2695 -0.2594 0.3694 -0.0338 -0.2484 -0.2286 0.4076 0.0360 -0.2255 -0.2032 -0.2428 0.2799 -0.1215 -0.2206 0.2933 -0.1944 -0.2531 -0.1498 -0.1192 -0.1866 0.1013 0.0956 0.0985 0.0915 0.1001 0.0973 0.0922 0.0993 0.1205 0.0999 0.0956 0.0866 0.0945 0.0892 0.0934 0.1363 0.1464 0.1464 0.1593 0.1486 0.1576 0.1454 0.1585 0.1576 0.1577
va: 2.1278 2.0693 2.0854 3.1119 3.6793 3.8040 3.8644 3.9020 3.9029 3.8636 4.2322 3.7070 3.9398 3.9283 3.7363 3.5571 4.0777 3.9517 3.9658 3.7327 3.8998 4.0147 3.6926 3.8995 4.0048 3.9019 3.8834 3.9082 1.0221 1.0350 1.0009 1.0139 1.0024 1.0021 1.0024 1.0032 1.0070 0.9984 0.9980 1.0084 0.9954 1.0077 0.9965 1.0183 1.0067 1.0119 0.9892 1.0047 0.9951 1.0088 0.9910 0.9890 0.9905
dispcorr: -0.026508327 hartree
energy: -1210.132605851589
dipole: 33.72090 -31.81864 1.90226 17.30139 -17.38166 -0.08027 16.82651 -15.60813 1.21839
magnitude: 2.26042 au
magnitude: 5.74554 debye
