program: Orca
programVersion: 5.0.2
elementType: O O O N C C C C C C C C C C C C C C C C C C C C C C C C H H H H H H H H H H H H H H H H H H H H H H H H H
charge: 0
multiplicity: 1
keywords: wb97x-d3
keywords: def2-TZVPP
keywords: def2/J RIJCOSX
keywords: DEFGRID2
keywords: scfconv7
keywords: smallprint printgap noloewdin
keywords: NOSOSCF
formula: C24H25NO3
InChI: InChI=1/C24H25NO3/c1-16(2)13-20-22(24(20,3)4)23(26)28-21(15-25)17-9-8-12-19(14-17)27-18-10-6-5-7-11-18/h5-14,20-22H,1-4H3
53 atoms
O  -0.888284 1.752365 1.242726
O  -0.147376 1.840228 -0.867472
O  -0.967426 -3.024472 -1.776472
N  -3.901152 1.275096 2.532383
C  2.559092 2.533908 0.592753
C  1.960568 3.76531 0.004424
C  1.105455 2.881915 0.887301
C  2.905592 1.377384 -0.312579
C  3.497371 2.673027 1.768005
C  2.358943 5.120861 0.464894
C  -0.003599 2.117566 0.292832
C  1.53154 6.142476 0.689279
C  0.046597 6.060873 0.509014
C  2.044256 7.47303 1.150739
C  -1.959523 0.918619 0.820028
C  -1.535086 -0.528565 0.762872
C  -3.035641 1.123553 1.792764
C  -1.440204 -1.1594 -0.463899
C  -1.203331 -1.207263 1.932034
C  -1.024495 -2.485916 -0.53157
C  -0.785508 -2.521794 1.851733
C  -0.693626 -3.173023 0.628119
C  -0.602393 -4.338014 -1.917523
C  -1.576498 -5.323928 -1.895822
C  0.731696 -4.659148 -2.11307
C  -1.206087 -6.64814 -2.076524
C  1.091163 -5.986828 -2.29172
C  0.126127 -6.983111 -2.270996
H  1.719832 3.683815 -1.053344
H  0.916467 3.239494 1.892934
H  2.253741 1.305234 -1.179568
H  3.928236 1.494808 -0.676059
H  2.854705 0.429706 0.226666
H  4.518097 2.85374 1.424365
H  3.220829 3.494947 2.427977
H  3.506768 1.757604 2.361597
H  3.424171 5.283344 0.604705
H  -0.304456 6.867372 -0.138678
H  -0.280659 5.121074 0.071127
H  -0.469189 6.185658 1.464724
H  3.1248 7.471948 1.28824
H  1.796249 8.259767 0.434325
H  1.58457 7.760778 2.099559
H  -2.332444 1.235344 -0.15899
H  -1.675832 -0.630128 -1.378228
H  -1.280128 -0.717751 2.894364
H  -0.529023 -3.060841 2.753889
H  -0.369728 -4.204234 0.592059
H  -2.61357 -5.052533 -1.746655
H  1.476256 -3.873854 -2.132089
H  -1.963582 -7.420508 -2.065122
H  2.130877 -6.241911 -2.447707
H  0.410595 -8.017164 -2.411193
totalener: -1210.08278365 hartree
nucrepener: 2430.78936802 hartree
electener: -3640.87215167 hartree
oneelecener: -6472.65461024 hartree
twoeener: 2831.78245857 hartree
kineticenergy: 1204.77220654 hartree
xcener: -118.588601282289 hartree
chargesum: 0.0000000
charge: -0.258491 -0.384251 -0.291826 -0.004879 0.119374 -0.004872 -0.137558 -0.259023 -0.270281 -0.245000 0.354017 -0.006901 -0.223016 -0.210655 0.315592 0.007648 -0.257560 -0.153250 -0.177649 0.236389 -0.131758 -0.159635 0.174425 -0.136047 -0.141144 -0.128151 -0.126826 -0.112271 0.107944 0.094188 0.100948 0.086233 0.088047 0.090586 0.087832 0.092800 0.093545 0.091731 0.081220 0.092908 0.078902 0.088310 0.085836 0.116027 0.113012 0.121443 0.129174 0.127243 0.129384 0.129409 0.129348 0.128614 0.128912
qa: -0.2585 -0.3843 -0.2918 -0.0049 0.1194 -0.0049 -0.1376 -0.2590 -0.2703 -0.2450 0.3540 -0.0069 -0.2230 -0.2107 0.3156 0.0076 -0.2576 -0.1532 -0.1776 0.2364 -0.1318 -0.1596 0.1744 -0.1360 -0.1411 -0.1282 -0.1268 -0.1123 0.1079 0.0942 0.1009 0.0862 0.0880 0.0906 0.0878 0.0928 0.0935 0.0917 0.0812 0.0929 0.0789 0.0883 0.0858 0.1160 0.1130 0.1214 0.1292 0.1272 0.1294 0.1294 0.1293 0.1286 0.1289
va: 2.1250 2.1191 2.1138 3.1225 3.7512 3.8044 3.8557 3.9055 3.9076 3.8947 4.1779 3.7425 3.9384 3.9420 3.8402 3.6726 4.0259 4.0520 4.0374 3.8957 3.9861 3.9316 3.8687 3.9940 3.9929 3.9445 3.9440 3.9318 1.0237 1.0287 1.0193 1.0023 1.0016 1.0017 1.0053 1.0064 1.0104 1.0025 1.0159 1.0009 1.0096 0.9990 0.9992 1.0205 1.0345 1.0165 1.0013 1.0118 1.0066 1.0069 0.9995 0.9996 0.9995
dispcorr: -0.025353587 hartree
energy: -1210.108137237728
dipole: 23.61572 -22.04615 1.56957 24.27823 -24.90764 -0.62941 3.47645 -3.73179 -0.25534
magnitude: 1.71024 au
magnitude: 4.34708 debye
