program: Orca
programVersion: 5.0.2
elementType: O O O N C C C C C C C C C C C C C C C C C C C C C C C C H H H H H H H H H H H H H H H H H H H H H H H H H
charge: 0
multiplicity: 1
keywords: wb97x-d3
keywords: def2-TZVPP
keywords: def2/J RIJCOSX
keywords: DEFGRID2
keywords: scfconv7
keywords: smallprint printgap noloewdin
keywords: NOSOSCF
formula: C24H25NO3
InChI: InChI=1/C24H25NO3/c1-16(2)13-20-22(24(20,3)4)23(26)28-21(15-25)17-9-8-12-19(14-17)27-18-10-6-5-7-11-18/h5-14,20-22H,1-4H3
53 atoms
O  -0.848063 1.377324 1.532972
O  -0.585354 2.335995 -0.470916
O  -0.751307 -3.445219 0.086894
N  -3.475196 0.601696 3.399473
C  2.460724 1.901701 0.178728
C  2.087853 3.32915 0.428972
C  1.259746 2.219698 1.054081
C  2.269285 1.343347 -1.211327
C  3.649881 1.297662 0.887548
C  2.867241 4.226684 1.29971
C  -0.120928 2.009122 0.586375
C  3.058909 5.537768 1.134822
C  2.504218 6.3548 0.007398
C  3.879958 6.318474 2.117727
C  -2.178674 1.048162 1.175004
C  -2.251768 -0.167988 0.280728
C  -2.885352 0.801424 2.434331
C  -1.456237 -1.270614 0.551743
C  -3.12693 -0.180759 -0.794186
C  -1.54127 -2.394787 -0.25757
C  -3.216045 -1.31476 -1.584969
C  -2.431389 -2.426505 -1.325927
C  -0.403581 -4.37676 -0.851805
C  -0.664462 -5.709054 -0.574104
C  0.242468 -4.010707 -2.025917
C  -0.2703 -6.683914 -1.479008
C  0.622496 -4.993331 -2.925843
C  0.367942 -6.33139 -2.658127
H  1.595223 3.802817 -0.412591
H  1.404422 2.04567 2.11435
H  1.458561 1.820674 -1.755666
H  3.185756 1.484052 -1.787029
H  2.06397 0.271549 -1.17503
H  3.576417 0.209053 0.888168
H  4.575082 1.569521 0.376585
H  3.741202 1.615854 1.924961
H  3.323729 3.766845 2.170959
H  3.311882 6.832433 -0.55259
H  1.906785 5.78456 -0.699675
H  1.876366 7.161558 0.393125
H  3.29043 7.117774 2.573805
H  4.269873 5.692096 2.919182
H  4.728822 6.800114 1.625803
H  -2.666823 1.8935 0.67831
H  -0.768879 -1.274122 1.388561
H  -3.732334 0.688214 -1.016493
H  -3.903522 -1.335861 -2.419789
H  -2.515825 -3.305514 -1.950758
H  -1.16585 -5.974629 0.347289
H  0.448949 -2.968021 -2.232406
H  -0.471122 -7.724423 -1.260868
H  1.126363 -4.709653 -3.84036
H  0.669131 -7.093956 -3.363364
totalener: -1210.08335180 hartree
nucrepener: 2431.08531067 hartree
electener: -3641.16866246 hartree
oneelecener: -6473.06321432 hartree
twoeener: 2831.89455185 hartree
kineticenergy: 1204.76819877 hartree
xcener: -118.589817290313 hartree
chargesum: -0.0000000
charge: -0.273177 -0.371891 -0.293693 -0.002295 0.080523 0.037785 -0.078444 -0.250383 -0.254070 -0.183104 0.320867 -0.052690 -0.236646 -0.200950 0.317779 0.058758 -0.253912 -0.224250 -0.146184 0.218438 -0.112966 -0.156671 0.216995 -0.185224 -0.159645 -0.102154 -0.118908 -0.132041 0.089598 0.078114 0.100316 0.088324 0.082708 0.092462 0.096015 0.075056 0.071917 0.086350 0.083405 0.087666 0.085894 0.076795 0.083370 0.121387 0.123383 0.105873 0.128027 0.134308 0.128511 0.135237 0.127179 0.128917 0.127338
qa: -0.2732 -0.3719 -0.2937 -0.0023 0.0805 0.0378 -0.0784 -0.2504 -0.2541 -0.1831 0.3209 -0.0527 -0.2366 -0.2009 0.3178 0.0588 -0.2539 -0.2242 -0.1462 0.2184 -0.1130 -0.1567 0.2170 -0.1852 -0.1596 -0.1022 -0.1189 -0.1320 0.0896 0.0781 0.1003 0.0883 0.0827 0.0925 0.0960 0.0751 0.0719 0.0864 0.0834 0.0877 0.0859 0.0768 0.0834 0.1214 0.1234 0.1059 0.1280 0.1343 0.1285 0.1352 0.1272 0.1289 0.1273
va: 2.1151 2.1334 2.1115 3.1233 3.7452 3.8089 3.8397 3.9135 3.9189 3.9102 4.2540 3.8325 3.9441 3.9338 3.8280 3.6779 4.0222 4.0489 4.0356 3.8773 3.9740 3.9318 3.8273 4.0357 3.9561 3.9368 3.9432 3.9515 1.0308 1.0363 1.0206 1.0012 1.0031 1.0042 1.0025 1.0107 1.0225 0.9991 1.0162 0.9991 0.9986 1.0124 0.9983 1.0210 1.0319 1.0135 1.0016 1.0045 1.0121 1.0015 0.9991 0.9997 0.9999
dispcorr: -0.024453336 hartree
energy: -1210.107805131386
dipole: 29.04696 -27.80319 1.24377 22.97283 -23.09790 -0.12506 -5.85809 4.43635 -1.42174
magnitude: 1.89313 au
magnitude: 4.81195 debye
