program: Orca
programVersion: 5.0.2
elementType: O O O N C C C C C C C C C C C C C C C C C C C C C C C C H H H H H H H H H H H H H H H H H H H H H H H H H
charge: 0
multiplicity: 1
keywords: wb97x-d3
keywords: def2-TZVPP
keywords: def2/J RIJCOSX
keywords: DEFGRID2
keywords: scfconv7
keywords: smallprint printgap noloewdin
keywords: NOSOSCF
formula: C24H25NO3
InChI: InChI=1/C24H25NO3/c1-16(2)13-20-22(24(20,3)4)23(26)28-21(15-25)17-9-8-12-19(14-17)27-18-10-6-5-7-11-18/h5-14,20-22H,1-4H3
53 atoms
O  -1.162268 1.874778 0.659021
O  0.354933 1.768615 -0.985004
O  -0.362872 -3.110833 -1.47512
N  -4.456159 2.153125 0.453631
C  2.342296 2.183492 1.408393
C  2.174402 3.46758 0.655343
C  0.946349 2.718408 1.129402
C  2.866123 0.977649 0.666349
C  2.784364 2.220747 2.851915
C  2.485882 4.786041 1.241893
C  0.063073 2.07957 0.138451
C  3.272835 5.726335 0.714268
C  3.999971 5.597508 -0.589386
C  3.492454 7.029918 1.422289
C  -2.105559 1.192731 -0.161926
C  -2.027114 -0.298103 0.062389
C  -3.417668 1.736725 0.19454
C  -1.278659 -1.068996 -0.814107
C  -2.648693 -0.887786 1.157288
C  -1.145895 -2.434752 -0.594531
C  -2.512326 -2.249244 1.362712
C  -1.762023 -3.03195 0.497984
C  -0.508486 -4.464153 -1.614277
C  -1.713422 -5.014917 -2.03107
C  0.594625 -5.268539 -1.378699
C  -1.807007 -6.386278 -2.205978
C  0.491002 -6.639269 -1.566843
C  -0.708499 -7.202652 -1.973982
H  2.347998 3.3738 -0.411197
H  0.430531 3.125034 1.992236
H  3.954088 0.947918 0.74853
H  2.477671 0.053056 1.097602
H  2.614717 0.984208 -0.391066
H  2.492399 1.302074 3.36311
H  3.87049 2.307239 2.912818
H  2.359049 3.054894 3.407837
H  2.018627 5.005126 2.197623
H  3.851293 4.63993 -1.083112
H  3.689151 6.381869 -1.283962
H  5.075028 5.72472 -0.440377
H  2.94849 7.083368 2.364402
H  4.552526 7.187056 1.636623
H  3.172421 7.87142 0.802627
H  -1.928678 1.420318 -1.217377
H  -0.783754 -0.617954 -1.664425
H  -3.243132 -0.294255 1.839798
H  -2.99428 -2.714678 2.211866
H  -1.661718 -4.093638 0.679662
H  -2.566983 -4.37655 -2.220983
H  1.525775 -4.818967 -1.059988
H  -2.74383 -6.817728 -2.532696
H  1.353058 -7.268031 -1.387968
H  -0.786948 -8.272009 -2.115578
totalener: -1210.08439571 hartree
nucrepener: 2403.84019263 hartree
electener: -3613.92458834 hartree
oneelecener: -6418.66507570 hartree
twoeener: 2804.74048736 hartree
kineticenergy: 1204.76657345 hartree
xcener: -118.589145915755 hartree
chargesum: -0.0000000
charge: -0.257065 -0.393185 -0.292618 -0.006473 0.092566 0.041826 -0.118901 -0.261709 -0.240689 -0.188341 0.369819 -0.047323 -0.236725 -0.203683 0.313610 0.005249 -0.255432 -0.170816 -0.164284 0.210122 -0.122807 -0.152464 0.210445 -0.152603 -0.180306 -0.119374 -0.106689 -0.128438 0.091019 0.076519 0.087333 0.088193 0.100450 0.093342 0.092535 0.072686 0.074296 0.082859 0.089026 0.085075 0.077616 0.083705 0.086256 0.121229 0.124674 0.120059 0.129482 0.133066 0.135915 0.126696 0.129199 0.127273 0.127791
qa: -0.2571 -0.3932 -0.2926 -0.0065 0.0926 0.0418 -0.1189 -0.2617 -0.2407 -0.1883 0.3698 -0.0473 -0.2367 -0.2037 0.3136 0.0052 -0.2554 -0.1708 -0.1643 0.2101 -0.1228 -0.1525 0.2104 -0.1526 -0.1803 -0.1194 -0.1067 -0.1284 0.0910 0.0765 0.0873 0.0882 0.1004 0.0933 0.0925 0.0727 0.0743 0.0829 0.0890 0.0851 0.0776 0.0837 0.0863 0.1212 0.1247 0.1201 0.1295 0.1331 0.1359 0.1267 0.1292 0.1273 0.1278
va: 2.1285 2.1081 2.1096 3.1182 3.7351 3.7822 3.9141 3.9147 3.9124 3.8981 4.2082 3.8181 3.9469 3.9355 3.8180 3.7171 4.0257 4.0089 4.0382 3.8943 3.9782 3.9358 3.8303 3.9675 4.0306 3.9421 3.9386 3.9467 1.0334 1.0388 1.0016 1.0024 1.0198 1.0043 1.0045 1.0110 1.0208 1.0145 0.9988 0.9996 1.0122 0.9986 0.9983 1.0211 1.0356 1.0177 1.0016 1.0057 1.0019 1.0120 0.9995 0.9992 0.9998
dispcorr: -0.024214053 hartree
energy: -1210.108609762738
dipole: 30.14506 -28.72081 1.42425 20.07203 -21.03246 -0.96042 9.21755 -8.82323 0.39432
magnitude: 1.76249 au
magnitude: 4.47990 debye
