program: Orca
programVersion: 5.0.2
elementType: O O O N C C C C C C C C C C C C C C C C C C C C C C C C H H H H H H H H H H H H H H H H H H H H H H H H H
charge: 0
multiplicity: 1
keywords: wb97x-d3
keywords: def2-TZVPP
keywords: def2/J RIJCOSX
keywords: DEFGRID2
keywords: scfconv7
keywords: smallprint printgap noloewdin
keywords: NOSOSCF
formula: C24H25NO3
InChI: InChI=1/C24H25NO3/c1-16(2)13-20-22(24(20,3)4)23(26)28-21(15-25)17-9-8-12-19(14-17)27-18-10-6-5-7-11-18/h5-14,20-22H,1-4H3
53 atoms
O  -1.045141 1.744232 -0.234692
O  0.804342 0.603608 -0.775273
O  -1.590212 -3.853799 0.367554
N  -3.805809 2.255462 -1.995108
C  1.98277 2.038569 1.739136
C  2.39923 2.795658 0.518755
C  0.938132 2.469847 0.719315
C  2.38092 0.588992 1.871675
C  1.925071 2.762535 3.0623
C  2.832615 4.217049 0.563397
C  0.278209 1.497832 -0.169599
C  4.023398 4.637493 0.991636
C  5.089521 3.712794 1.494237
C  4.385599 6.091547 0.991068
C  -1.827638 0.852868 -1.021037
C  -2.325177 -0.306785 -0.192717
C  -2.933394 1.650235 -1.556945
C  -1.718507 -1.546802 -0.343051
C  -3.338274 -0.123524 0.738861
C  -2.143948 -2.615493 0.437336
C  -3.744344 -1.194544 1.51838
C  -3.157603 -2.439572 1.370887
C  -0.905232 -4.221741 -0.760217
C  0.44296 -4.517531 -0.647425
C  -1.559303 -4.338818 -1.979299
C  1.143805 -4.937513 -1.768875
C  -0.847126 -4.752798 -3.093538
C  0.504661 -5.051625 -2.993584
H  2.87871 2.184738 -0.242692
H  0.301228 3.288063 1.037419
H  2.504951 0.090876 0.913964
H  3.330461 0.524208 2.407006
H  1.642379 0.030009 2.448989
H  2.908641 2.769473 3.536117
H  1.607168 3.798935 2.959585
H  1.232745 2.261865 3.74098
H  2.122217 4.955599 0.203453
H  4.777209 2.67037 1.505311
H  5.986485 3.78619 0.874232
H  5.393356 3.985086 2.507994
H  3.570709 6.717511 0.630131
H  4.649641 6.429176 1.996256
H  5.25824 6.279481 0.360907
H  -1.246284 0.479487 -1.869448
H  -0.911071 -1.667833 -1.05364
H  -3.816151 0.84133 0.850195
H  -4.536697 -1.062641 2.242769
H  -3.479057 -3.279932 1.971925
H  0.933898 -4.422154 0.311996
H  -2.615231 -4.111885 -2.053783
H  2.196809 -5.169523 -1.68225
H  -1.354174 -4.846017 -4.04467
H  1.055057 -5.375635 -3.866336
totalener: -1210.08315978 hartree
nucrepener: 2454.67948405 hartree
electener: -3664.76264382 hartree
oneelecener: -6520.42576772 hartree
twoeener: 2855.66312390 hartree
kineticenergy: 1204.77120988 hartree
xcener: -118.588723679283 hartree
chargesum: -0.0000000
charge: -0.259633 -0.392039 -0.296089 -0.006215 0.060652 -0.030583 -0.101110 -0.263653 -0.246441 -0.188520 0.369493 -0.022418 -0.244879 -0.208654 0.314930 -0.016642 -0.257007 -0.113690 -0.180043 0.214798 -0.092769 -0.197834 0.206455 -0.168204 -0.152531 -0.107593 -0.119606 -0.125564 0.111219 0.085496 0.103804 0.082344 0.093239 0.085253 0.085361 0.099288 0.092262 0.082944 0.100028 0.088497 0.081020 0.084232 0.087459 0.117735 0.128408 0.120118 0.127967 0.127815 0.124543 0.133515 0.126339 0.128855 0.127646
qa: -0.2596 -0.3920 -0.2961 -0.0062 0.0607 -0.0306 -0.1011 -0.2637 -0.2464 -0.1885 0.3695 -0.0224 -0.2449 -0.2087 0.3149 -0.0166 -0.2570 -0.1137 -0.1800 0.2148 -0.0928 -0.1978 0.2065 -0.1682 -0.1525 -0.1076 -0.1196 -0.1256 0.1112 0.0855 0.1038 0.0823 0.0932 0.0853 0.0854 0.0993 0.0923 0.0829 0.1000 0.0885 0.0810 0.0842 0.0875 0.1177 0.1284 0.1201 0.1280 0.1278 0.1245 0.1335 0.1263 0.1289 0.1276
va: 2.1318 2.1091 2.1118 3.1197 3.7385 3.8232 3.8623 3.9062 3.9083 3.8571 4.2104 3.7412 3.9346 3.9376 3.8315 3.7131 4.0251 3.8648 4.0474 3.8707 3.9507 4.0382 3.8444 4.0317 3.9786 3.9428 3.9474 3.9500 1.0223 1.0345 1.0204 1.0025 1.0026 1.0019 1.0071 1.0058 1.0127 1.0099 1.0037 0.9987 1.0105 0.9993 0.9983 1.0232 1.0263 1.0161 0.9997 1.0125 1.0121 1.0036 0.9996 0.9997 0.9998
dispcorr: -0.025629483 hartree
energy: -1210.108789261650
dipole: 32.34081 -30.96589 1.37493 20.08818 -20.46490 -0.37672 14.97825 -14.11205 0.86620
magnitude: 1.66813 au
magnitude: 4.24004 debye
