program: Orca
programVersion: 5.0.2
elementType: O O O N C C C C C C C C C C C C C C C C C C C C C C C C H H H H H H H H H H H H H H H H H H H H H H H H H
charge: 0
multiplicity: 1
keywords: wb97x-d3
keywords: def2-TZVPP
keywords: def2/J RIJCOSX
keywords: DEFGRID2
keywords: scfconv7
keywords: smallprint printgap noloewdin
keywords: NOSOSCF
formula: C24H25NO3
InChI: InChI=1/C24H25NO3/c1-16(2)13-20-22(24(20,3)4)23(26)28-21(15-25)17-9-8-12-19(14-17)27-18-10-6-5-7-11-18/h5-14,20-22H,1-4H3
53 atoms
O  0.388347 1.230875 -0.411262
O  1.435589 1.207172 1.574437
O  -2.823986 -3.827116 0.328436
N  1.494732 -0.938052 -2.683033
C  0.448737 4.202234 1.635417
C  1.894506 4.150753 1.282129
C  0.915743 3.288392 0.509808
C  -0.002752 3.624361 2.954265
C  -0.370967 5.391665 1.192099
C  2.581558 5.28425 0.610466
C  0.961916 1.825177 0.662152
C  3.494129 5.17567 -0.356332
C  3.951479 3.865563 -0.920556
C  4.141604 6.386991 -0.955955
C  0.347979 -0.179068 -0.457108
C  -1.073934 -0.698437 -0.419326
C  0.995932 -0.590192 -1.708403
C  -1.272079 -2.021591 -0.049306
C  -2.147978 0.100989 -0.780155
C  -2.554974 -2.552699 -0.055165
C  -3.426793 -0.43684 -0.759474
C  -3.638265 -1.758016 -0.407575
C  -1.934451 -4.832048 0.06603
C  -1.324522 -4.971135 -1.174561
C  -1.705328 -5.755986 1.074114
C  -0.476384 -6.045028 -1.394949
C  -0.863504 -6.831577 0.835407
C  -0.241878 -6.978364 -0.3953
H  2.505274 3.587743 1.984513
H  0.66466 3.62695 -0.488739
H  -1.032241 3.266364 2.894806
H  0.619818 2.800067 3.293009
H  0.031057 4.400618 3.720856
H  -1.423613 5.119219 1.102036
H  -0.301552 6.19897 1.923942
H  -0.046045 5.788214 0.230388
H  2.328744 6.278046 0.96946
H  5.038171 3.778399 -0.850652
H  3.519932 3.005239 -0.414877
H  3.7037 3.790789 -1.982442
H  3.971669 6.427544 -2.03471
H  3.765403 7.312267 -0.521579
H  5.224498 6.363806 -0.812984
H  0.917017 -0.606873 0.37501
H  -0.428699 -2.637241 0.241524
H  -1.998304 1.129792 -1.074274
H  -4.271174 0.180127 -1.036127
H  -4.633983 -2.180919 -0.400034
H  -1.509134 -4.253361 -1.963656
H  -2.192445 -5.631964 2.032311
H  -0.000388 -6.152507 -2.360472
H  -0.688598 -7.554094 1.621508
H  0.418826 -7.815143 -0.576409
totalener: -1210.08200118 hartree
nucrepener: 2413.22495136 hartree
electener: -3623.30695254 hartree
oneelecener: -6437.39329237 hartree
twoeener: 2814.08633983 hartree
kineticenergy: 1204.75942077 hartree
xcener: -118.588526735649 hartree
chargesum: -0.0000000
charge: -0.285993 -0.374544 -0.297625 -0.005293 0.132753 -0.018358 -0.146763 -0.258290 -0.271387 -0.241068 0.346712 -0.008509 -0.220339 -0.209473 0.316024 0.090189 -0.253766 -0.205475 -0.190818 0.223860 -0.087910 -0.196763 0.245124 -0.170282 -0.212025 -0.108263 -0.088550 -0.145292 0.108413 0.093423 0.088266 0.101478 0.086320 0.091770 0.092118 0.088078 0.093880 0.091734 0.080848 0.092994 0.086244 0.078480 0.088591 0.130556 0.121230 0.125324 0.126957 0.128644 0.136426 0.126152 0.131384 0.126195 0.126617
qa: -0.2860 -0.3745 -0.2976 -0.0053 0.1328 -0.0184 -0.1468 -0.2583 -0.2714 -0.2411 0.3467 -0.0085 -0.2203 -0.2095 0.3160 0.0902 -0.2538 -0.2055 -0.1908 0.2239 -0.0879 -0.1968 0.2451 -0.1703 -0.2120 -0.1083 -0.0885 -0.1453 0.1084 0.0934 0.0883 0.1015 0.0863 0.0918 0.0921 0.0881 0.0939 0.0917 0.0808 0.0930 0.0862 0.0785 0.0886 0.1306 0.1212 0.1253 0.1270 0.1286 0.1364 0.1262 0.1314 0.1262 0.1266
va: 2.0899 2.1355 2.1138 3.1221 3.7306 3.8354 3.8261 3.9068 3.9109 3.8926 4.1836 3.7435 3.9396 3.9414 3.7601 3.7236 4.0061 3.9925 4.0138 3.8663 3.9466 4.0364 3.7930 3.9504 4.0443 3.9466 3.9310 3.9623 1.0226 1.0297 1.0019 1.0189 1.0026 1.0067 1.0019 1.0044 1.0104 1.0022 1.0167 1.0013 0.9994 1.0096 0.9991 1.0402 1.0130 1.0212 1.0003 1.0117 1.0034 1.0137 0.9991 0.9987 1.0003
dispcorr: -0.024806701 hartree
energy: -1210.106807879007
dipole: 13.07286 -13.62435 -0.55149 34.15192 -33.31143 0.84049 5.26211 -4.72802 0.53409
magnitude: 1.13834 au
magnitude: 2.89344 debye
