program: Orca
programVersion: 5.0.2
elementType: O O O N C C C C C C C C C C C C C C C C C C C C C C C C H H H H H H H H H H H H H H H H H H H H H H H H H
charge: 0
multiplicity: 1
keywords: wb97x-d3
keywords: def2-TZVPP
keywords: def2/J RIJCOSX
keywords: DEFGRID2
keywords: scfconv7
keywords: smallprint printgap noloewdin
keywords: NOSOSCF
formula: C24H25NO3
InChI: InChI=1/C24H25NO3/c1-16(2)13-20-22(24(20,3)4)23(26)28-21(15-25)17-9-8-12-19(14-17)27-18-10-6-5-7-11-18/h5-14,20-22H,1-4H3
53 atoms
O  -0.783939 1.800132 -0.14934
O  0.599983 0.483056 -1.308729
O  -1.373402 -3.942014 -0.08792
N  -4.034328 2.291852 0.020422
C  1.50677 3.869483 -0.392882
C  1.377638 3.316761 0.985469
C  1.506744 2.361919 -0.186976
C  0.325213 4.569922 -1.020276
C  2.831785 4.448781 -0.82944
C  2.467008 3.410713 1.99064
C  0.43111 1.452209 -0.620466
C  2.670629 2.535458 2.975963
C  1.832234 1.310026 3.174516
C  3.771474 2.725546 3.974526
C  -1.859764 0.925848 -0.46225
C  -1.804834 -0.336687 0.363599
C  -3.073845 1.698142 -0.189162
C  -1.644019 -1.553331 -0.277029
C  -1.860007 -0.268132 1.750211
C  -1.516104 -2.714554 0.475081
C  -1.747761 -1.433851 2.489504
C  -1.567339 -2.655647 1.860738
C  -0.682505 -4.102613 -1.257009
C  -1.157868 -5.065717 -2.135216
C  0.472464 -3.38779 -1.550424
C  -0.470456 -5.316985 -3.312149
C  1.141232 -3.641357 -2.737905
C  0.677494 -4.60329 -3.622705
H  0.374484 3.378411 1.39767
H  2.476953 1.895352 -0.312596
H  0.323721 4.441254 -2.104236
H  -0.632584 4.226452 -0.637584
H  0.388385 5.640615 -0.818509
H  2.924474 4.413586 -1.915942
H  2.91313 5.494309 -0.525002
H  3.682528 3.913459 -0.408447
H  3.117875 4.277863 1.928035
H  1.043068 1.200242 2.433528
H  2.44942 0.409033 3.137609
H  1.362644 1.321846 4.161336
H  3.371521 2.806908 4.988254
H  4.451586 1.870187 3.97647
H  4.358215 3.6210 3.773507
H  -1.854394 0.672309 -1.527396
H  -1.591684 -1.590672 -1.357371
H  -1.992352 0.683115 2.250115
H  -1.791418 -1.393097 3.569497
H  -1.467295 -3.56635 2.436275
H  -2.057163 -5.614683 -1.888806
H  0.847653 -2.630822 -0.874037
H  -0.842584 -6.07062 -3.993442
H  2.034651 -3.076331 -2.96759
H  1.206808 -4.795088 -4.546052
totalener: -1210.07965633 hartree
nucrepener: 2516.18123478 hartree
electener: -3726.26089111 hartree
oneelecener: -6643.24240178 hartree
twoeener: 2916.98151067 hartree
kineticenergy: 1204.77615135 hartree
xcener: -118.591237984999 hartree
chargesum: -0.0000000
charge: -0.265267 -0.361279 -0.296944 0.001117 0.132413 0.002174 -0.115744 -0.257667 -0.283314 -0.250528 0.352992 -0.011660 -0.187399 -0.212722 0.292267 0.069946 -0.266951 -0.160858 -0.252272 0.254863 -0.071687 -0.205393 0.269375 -0.226607 -0.175222 -0.083264 -0.106360 -0.151145 0.103450 0.087478 0.094149 0.094456 0.086656 0.094979 0.093310 0.084848 0.095970 0.046790 0.088205 0.088609 0.087684 0.086119 0.079293 0.117199 0.120955 0.125859 0.127886 0.127869 0.124413 0.132137 0.124864 0.129102 0.124859
qa: -0.2653 -0.3613 -0.2969 0.0011 0.1324 0.0022 -0.1157 -0.2577 -0.2833 -0.2505 0.3530 -0.0117 -0.1874 -0.2127 0.2923 0.0699 -0.2670 -0.1609 -0.2523 0.2549 -0.0717 -0.2054 0.2694 -0.2266 -0.1752 -0.0833 -0.1064 -0.1511 0.1034 0.0875 0.0941 0.0945 0.0867 0.0950 0.0933 0.0848 0.0960 0.0468 0.0882 0.0886 0.0877 0.0861 0.0793 0.1172 0.1210 0.1259 0.1279 0.1279 0.1244 0.1321 0.1249 0.1291 0.1249
va: 2.1006 2.1457 2.1208 3.1164 3.7237 3.7962 3.8427 3.9050 3.9225 3.8941 4.1859 3.7663 3.9377 3.9422 3.8872 3.5762 4.0130 3.9388 4.0179 3.8593 3.9210 4.0497 3.7778 4.0482 3.9401 3.9265 3.9479 3.9636 1.0211 1.0291 1.0009 1.0117 1.0042 1.0056 1.0002 1.0045 1.0096 1.0265 1.0039 1.0024 0.9983 0.9991 1.0099 1.0192 1.0165 1.0147 0.9992 1.0119 1.0146 1.0119 0.9988 0.9996 1.0005
dispcorr: -0.027409408 hartree
energy: -1210.107065742407
dipole: 24.28697 -22.83783 1.44914 20.32475 -20.34710 -0.02235 9.32435 -9.04827 0.27608
magnitude: 1.47537 au
magnitude: 3.75010 debye
