program: Orca
programVersion: 5.0.2
elementType: O O O N C C C C C C C C C C C C C C C C C C C C C C C C H H H H H H H H H H H H H H H H H H H H H H H H H
charge: 0
multiplicity: 1
keywords: wb97x-d3
keywords: def2-TZVPP
keywords: def2/J RIJCOSX
keywords: DEFGRID2
keywords: scfconv7
keywords: smallprint printgap noloewdin
keywords: NOSOSCF
formula: C24H25NO3
InChI: InChI=1/C24H25NO3/c1-16(2)13-20-22(24(20,3)4)23(26)28-21(15-25)17-9-8-12-19(14-17)27-18-10-6-5-7-11-18/h5-14,20-22H,1-4H3
53 atoms
O  -0.0217 0.945904 0.897244
O  -1.075486 2.865833 0.425138
O  -1.503267 -3.348344 -1.930044
N  -0.732734 -1.260059 3.268798
C  1.475264 3.434767 -1.29158
C  1.637248 4.108587 0.027983
C  1.269483 2.639019 -0.010086
C  0.303556 3.803799 -2.168195
C  2.711468 3.06124 -2.075289
C  2.969989 4.53618 0.52569
C  -0.066091 2.213096 0.435945
C  3.471977 4.313315 1.741348
C  2.752509 3.57056 2.825456
C  4.835493 4.810601 2.117468
C  -1.258161 0.363676 1.290692
C  -1.906495 -0.345704 0.128198
C  -0.947158 -0.548777 2.393051
C  -1.38936 -1.554806 -0.320766
C  -2.977169 0.249137 -0.522916
C  -1.969189 -2.181703 -1.414386
C  -3.538414 -0.380496 -1.624177
C  -3.045923 -1.594141 -2.068863
C  -0.935857 -4.293557 -1.120677
C  0.203275 -4.928724 -1.591428
C  -1.496951 -4.658267 0.096788
C  0.781944 -5.939792 -0.839597
C  -0.899967 -5.661342 0.843925
C  0.238092 -6.306501 0.382071
H  0.808097 4.75799 0.301021
H  2.063215 1.940542 0.227706
H  -0.563108 4.135544 -1.602993
H  0.594779 4.615485 -2.837472
H  -0.002537 2.959886 -2.789076
H  3.544915 2.781713 -1.431157
H  2.503418 2.219784 -2.737929
H  3.038863 3.89724 -2.69659
H  3.571678 5.107216 -0.176397
H  3.285036 2.653264 3.089509
H  2.710153 4.174188 3.734993
H  1.732776 3.302085 2.562233
H  5.324077 5.333179 1.296132
H  4.782297 5.49476 2.967704
H  5.482443 3.984839 2.423765
H  -1.936486 1.129817 1.678205
H  -0.545774 -2.008999 0.185621
H  -3.362682 1.199951 -0.180523
H  -4.3741 0.075695 -2.13746
H  -3.48595 -2.094469 -2.921435
H  0.624295 -4.633283 -2.543406
H  -2.389933 -4.167562 0.462006
H  1.668697 -6.436534 -1.210431
H  -1.334282 -5.940632 1.794504
H  0.696089 -7.089483 0.970738
totalener: -1210.08323831 hartree
nucrepener: 2458.59147373 hartree
electener: -3668.67471204 hartree
oneelecener: -6528.32086319 hartree
twoeener: 2859.64615115 hartree
kineticenergy: 1204.77241232 hartree
xcener: -118.590243688008 hartree
chargesum: -0.0000000
charge: -0.262149 -0.389254 -0.297676 -0.004715 0.116683 -0.000803 -0.152893 -0.262014 -0.264927 -0.244005 0.366287 -0.009125 -0.221749 -0.209400 0.330301 0.010822 -0.267301 -0.194658 -0.139611 0.227816 -0.090024 -0.204280 0.254655 -0.215861 -0.173796 -0.086811 -0.099589 -0.147288 0.105807 0.097747 0.101114 0.085119 0.089173 0.086999 0.094255 0.089839 0.093574 0.093376 0.092343 0.085282 0.078362 0.088503 0.085389 0.119905 0.128995 0.121550 0.128019 0.128017 0.124344 0.132834 0.125446 0.128954 0.126419
qa: -0.2621 -0.3893 -0.2977 -0.0047 0.1167 -0.0008 -0.1529 -0.2620 -0.2649 -0.2440 0.3663 -0.0091 -0.2217 -0.2094 0.3303 0.0108 -0.2673 -0.1947 -0.1396 0.2278 -0.0900 -0.2043 0.2547 -0.2159 -0.1738 -0.0868 -0.0996 -0.1473 0.1058 0.0977 0.1011 0.0851 0.0892 0.0870 0.0943 0.0898 0.0936 0.0934 0.0923 0.0853 0.0784 0.0885 0.0854 0.1199 0.1290 0.1215 0.1280 0.1280 0.1243 0.1328 0.1254 0.1290 0.1264
va: 2.1187 2.1128 2.1167 3.1191 3.7434 3.7976 3.8739 3.9081 3.9070 3.8903 4.1597 3.7540 3.9349 3.9409 3.8285 3.6810 4.0339 3.9946 3.9749 3.8521 3.9476 4.0386 3.7932 4.0492 3.9569 3.9307 3.9497 3.9685 1.0226 1.0276 1.0203 1.0022 1.0016 1.0061 1.0058 1.0025 1.0114 1.0013 1.0023 1.0133 1.0098 0.9992 0.9997 1.0238 1.0154 1.0203 0.9997 1.0121 1.0142 1.0037 0.9989 0.9997 1.0005
dispcorr: -0.025531006 hartree
energy: -1210.108769315405
dipole: 22.91891 -22.44685 0.47206 25.58075 -25.09822 0.48253 -1.93936 1.03806 -0.90130
magnitude: 1.12607 au
magnitude: 2.86223 debye
