program: Orca
programVersion: 5.0.2
elementType: O O O N C C C C C C C C C C C C C C C C C C C C C C C C H H H H H H H H H H H H H H H H H H H H H H H H H
charge: 0
multiplicity: 1
keywords: wb97x-d3
keywords: def2-TZVPP
keywords: def2/J RIJCOSX
keywords: DEFGRID2
keywords: scfconv7
keywords: smallprint printgap noloewdin
keywords: NOSOSCF
formula: C24H25NO3
InChI: InChI=1/C24H25NO3/c1-16(2)13-20-22(24(20,3)4)23(26)28-21(15-25)17-9-8-12-19(14-17)27-18-10-6-5-7-11-18/h5-14,20-22H,1-4H3
53 atoms
O  -1.061583 1.710302 -0.028277
O  0.736581 0.646815 -0.838583
O  -1.685963 -3.77619 0.283133
N  -3.748772 2.654912 -1.705466
C  1.991563 1.550497 1.88764
C  2.451581 2.474981 0.80326
C  0.969157 2.198745 0.969336
C  2.312503 0.08061 1.760475
C  1.980029 2.02431 3.321308
C  2.955366 3.836765 1.062366
C  0.254442 1.426909 -0.061551
C  4.023859 4.41486 0.509027
C  4.941016 3.756174 -0.475928
C  4.392207 5.828089 0.850193
C  -1.908138 0.980026 -0.911405
C  -2.478515 -0.228658 -0.20955
C  -2.941294 1.92202 -1.345608
C  -1.819465 -1.445297 -0.35141
C  -3.587142 -0.118044 0.616765
C  -2.281221 -2.557418 0.341067
C  -4.036489 -1.236841 1.302245
C  -3.393127 -2.453603 1.169746
C  -0.779073 -4.037515 -0.710511
C  -1.205307 -4.209803 -2.019926
C  0.558397 -4.168972 -0.37541
C  -0.276188 -4.521779 -2.99953
C  1.478706 -4.48799 -1.363458
C  1.06636 -4.661522 -2.67585
H  2.888377 1.965032 -0.048128
H  0.3791 2.986669 1.42389
H  2.39789 -0.249468 0.728175
H  3.263071 -0.125986 2.256591
H  1.547286 -0.528947 2.246219
H  2.973752 1.926884 3.761759
H  1.675842 3.064552 3.42693
H  1.291248 1.420851 3.914447
H  2.3778 4.430781 1.764418
H  4.961215 4.313824 -1.415543
H  5.96611 3.749814 -0.097595
H  4.672221 2.728302 -0.707485
H  3.707496 6.269198 1.573525
H  5.401841 5.884074 1.264845
H  4.387015 6.459148 -0.042308
H  -1.352433 0.666057 -1.799921
H  -0.944551 -1.511776 -0.985296
H  -4.10522 0.826369 0.722214
H  -4.904135 -1.161318 1.943805
H  -3.744219 -3.328664 1.700632
H  -2.254592 -4.108065 -2.266321
H  0.870434 -4.029598 0.651389
H  -0.605188 -4.66092 -4.020858
H  2.523463 -4.596125 -1.104088
H  1.786746 -4.908495 -3.443818
totalener: -1210.08424187 hartree
nucrepener: 2469.46127974 hartree
electener: -3679.54552162 hartree
oneelecener: -6549.91714996 hartree
twoeener: 2870.37162835 hartree
kineticenergy: 1204.76474116 hartree
xcener: -118.588623987825 hartree
chargesum: 0.0000000
charge: -0.255922 -0.393163 -0.294971 -0.006202 0.085705 0.046198 -0.106590 -0.261042 -0.244946 -0.184142 0.367391 -0.053843 -0.236383 -0.201207 0.306711 -0.014289 -0.254021 -0.147605 -0.181798 0.234495 -0.084989 -0.206130 0.204502 -0.150583 -0.160390 -0.122415 -0.113217 -0.117295 0.090011 0.076467 0.099328 0.087937 0.086952 0.093075 0.073119 0.092727 0.071912 0.088604 0.085818 0.082057 0.076947 0.083508 0.086362 0.121782 0.136410 0.120273 0.128538 0.126873 0.131668 0.123423 0.128965 0.126232 0.127155
qa: -0.2559 -0.3932 -0.2950 -0.0062 0.0857 0.0462 -0.1066 -0.2610 -0.2449 -0.1841 0.3674 -0.0538 -0.2364 -0.2012 0.3067 -0.0143 -0.2540 -0.1476 -0.1818 0.2345 -0.0850 -0.2061 0.2045 -0.1506 -0.1604 -0.1224 -0.1132 -0.1173 0.0900 0.0765 0.0993 0.0879 0.0870 0.0931 0.0731 0.0927 0.0719 0.0886 0.0858 0.0821 0.0769 0.0835 0.0864 0.1218 0.1364 0.1203 0.1285 0.1269 0.1317 0.1234 0.1290 0.1262 0.1272
va: 2.1262 2.1080 2.1153 3.1183 3.7387 3.7851 3.8871 3.9159 3.9162 3.9026 4.2093 3.8335 3.9451 3.9343 3.8294 3.7582 4.0265 3.8647 4.0511 3.8575 3.9496 4.0464 3.8424 3.9882 4.0243 3.9497 3.9475 3.9455 1.0320 1.0383 1.0196 1.0016 1.0024 1.0037 1.0110 1.0039 1.0224 0.9989 0.9995 1.0155 1.0125 0.9985 0.9983 1.0236 1.0252 1.0181 0.9994 1.0134 1.0048 1.0115 0.9996 0.9998 1.0000
dispcorr: -0.024893331 hartree
energy: -1210.109135203867
dipole: 32.50816 -31.15661 1.35155 17.11715 -17.75362 -0.63647 11.25739 -10.54227 0.71513
magnitude: 1.65625 au
magnitude: 4.20986 debye
