program: Orca
programVersion: 5.0.2
elementType: O O O N C C C C C C C C C C C C C C C C C C C C C C C C H H H H H H H H H H H H H H H H H H H H H H H H H
charge: 0
multiplicity: 1
keywords: wb97x-d3
keywords: def2-TZVPP
keywords: def2/J RIJCOSX
keywords: DEFGRID2
keywords: scfconv7
keywords: smallprint printgap noloewdin
keywords: NOSOSCF
formula: C24H25NO3
InChI: InChI=1/C24H25NO3/c1-16(2)13-20-22(24(20,3)4)23(26)28-21(15-25)17-9-8-12-19(14-17)27-18-10-6-5-7-11-18/h5-14,20-22H,1-4H3
53 atoms
O  -1.090983 1.429261 -0.494829
O  -1.027531 3.387953 0.57615
O  -1.30654 -3.619843 -0.802397
N  -1.929175 0.871923 2.754975
C  1.627612 3.941985 -0.980443
C  2.01315 3.008298 0.116065
C  0.827105 2.674533 -0.784585
C  1.052832 5.292146 -0.625237
C  2.471409 3.969066 -2.234104
C  3.228289 2.155541 0.062298
C  -0.505332 2.602537 -0.164848
C  3.29478 0.889396 0.478233
C  2.13346 0.14041 1.056999
C  4.568373 0.104884 0.386255
C  -2.291421 1.086213 0.170527
C  -2.713514 -0.269914 -0.338668
C  -2.077827 1.006068 1.623849
C  -1.7836 -1.30335 -0.323574
C  -4.003246 -0.485473 -0.789835
C  -2.157588 -2.563223 -0.759966
C  -4.365728 -1.753719 -1.227992
C  -3.454766 -2.791607 -1.213709
C  -0.135172 -3.579991 -0.092996
C  1.058726 -3.657201 -0.791184
C  -0.143958 -3.514368 1.294303
C  2.257045 -3.684464 -0.090988
C  1.059089 -3.531594 1.981344
C  2.261743 -3.619597 1.293622
H  1.721235 3.344163 1.108776
H  1.018341 1.887147 -1.504157
H  0.505752 5.289179 0.312934
H  1.862545 6.018982 -0.541248
H  0.374841 5.643581 -1.404648
H  3.325525 4.636929 -2.106674
H  2.857221 2.984927 -2.500057
H  1.887839 4.337392 -3.079181
H  4.128514 2.617639 -0.33336
H  2.412413 -0.328484 2.002823
H  1.266025 0.766602 1.249205
H  1.827876 -0.675143 0.39538
H  5.370573 0.672186 -0.0839
H  4.909284 -0.20361 1.377387
H  4.418252 -0.812002 -0.189534
H  -3.07318 1.829587 -0.016105
H  -0.776205 -1.118263 0.026515
H  -4.724047 0.321894 -0.801292
H  -5.371873 -1.933621 -1.581469
H  -3.734188 -3.780924 -1.550968
H  1.044938 -3.707455 -1.871903
H  -1.082026 -3.452046 1.8311
H  3.190173 -3.754714 -0.634271
H  1.053786 -3.479791 3.061831
H  3.197352 -3.637077 1.835974
totalener: -1210.07922715 hartree
nucrepener: 2571.71342716 hartree
electener: -3781.79265432 hartree
oneelecener: -6754.47541554 hartree
twoeener: 2972.68276122 hartree
kineticenergy: 1204.77864257 hartree
xcener: -118.591713143117 hartree
chargesum: -0.0000000
charge: -0.267377 -0.356625 -0.294958 -0.004825 0.160694 -0.031615 -0.136230 -0.255826 -0.273713 -0.232703 0.318916 0.024451 -0.225398 -0.223186 0.328846 0.033933 -0.263294 -0.142921 -0.175536 0.240183 -0.075999 -0.216879 0.211860 -0.151647 -0.148614 -0.137910 -0.114031 -0.127660 0.114013 0.087563 0.102499 0.082022 0.084742 0.092130 0.085553 0.091961 0.093940 0.094420 0.081359 0.076138 0.082182 0.088860 0.077804 0.105701 0.083321 0.112043 0.126794 0.127106 0.125847 0.136214 0.126003 0.132302 0.127546
qa: -0.2674 -0.3566 -0.2950 -0.0048 0.1607 -0.0316 -0.1362 -0.2558 -0.2737 -0.2327 0.3189 0.0245 -0.2254 -0.2232 0.3288 0.0339 -0.2633 -0.1429 -0.1755 0.2402 -0.0760 -0.2169 0.2119 -0.1516 -0.1486 -0.1379 -0.1140 -0.1277 0.1140 0.0876 0.1025 0.0820 0.0847 0.0921 0.0856 0.0920 0.0939 0.0944 0.0814 0.0761 0.0822 0.0889 0.0778 0.1057 0.0833 0.1120 0.1268 0.1271 0.1258 0.1362 0.1260 0.1323 0.1275
va: 2.1319 2.1362 2.1200 3.1112 3.7143 3.8527 3.8534 3.9009 3.9098 3.8790 4.2104 3.6970 3.9643 3.9465 3.8703 3.7665 3.9764 3.9565 3.9957 3.8412 3.9641 4.0388 3.8337 3.9909 3.9598 3.9081 3.9098 3.8777 1.0179 1.0313 1.0220 1.0016 1.0033 1.0015 1.0047 1.0067 1.0091 1.0031 1.0253 0.9966 1.0120 0.9987 1.0010 1.0198 1.0453 1.0124 0.9999 1.0135 1.0114 1.0027 1.0011 0.9993 1.0013
dispcorr: -0.029614146 hartree
energy: -1210.108841296696
dipole: 26.04823 -25.41344 0.63479 12.76338 -13.30351 -0.54014 -4.59192 3.23927 -1.35265
magnitude: 1.58883 au
magnitude: 4.03848 debye
