program: Orca
programVersion: 5.0.2
elementType: O O O N C C C C C C C C C C C C C C C C C C C C C C C C H H H H H H H H H H H H H H H H H H H H H H H H H
charge: 0
multiplicity: 1
keywords: wb97x-d3
keywords: def2-TZVPP
keywords: def2/J RIJCOSX
keywords: DEFGRID2
keywords: scfconv7
keywords: smallprint printgap noloewdin
keywords: NOSOSCF
formula: C24H25NO3
InChI: InChI=1/C24H25NO3/c1-16(2)13-20-22(24(20,3)4)23(26)28-21(15-25)17-9-8-12-19(14-17)27-18-10-6-5-7-11-18/h5-14,20-22H,1-4H3
53 atoms
O  -0.976032 1.600243 1.406422
O  -0.768822 2.522189 -0.622204
O  0.010655 -2.911193 -0.350229
N  -3.502137 0.498955 3.246254
C  2.255281 1.81128 0.029811
C  2.035782 3.289893 0.01046
C  1.121967 2.417912 0.846188
C  1.952419 1.022649 -1.222901
C  3.392326 1.222674 0.830723
C  2.951408 4.253655 0.658304
C  -0.276444 2.221379 0.429425
C  2.842462 5.582978 0.611341
C  1.733012 6.312338 -0.083212
C  3.856618 6.464203 1.276291
C  -2.257631 1.128114 1.036106
C  -2.168951 -0.074321 0.120682
C  -2.936327 0.778857 2.286665
C  -1.161746 -1.0078 0.312578
C  -3.090938 -0.239558 -0.901004
C  -1.058442 -2.094009 -0.543818
C  -2.994731 -1.343828 -1.733222
C  -1.979574 -2.272554 -1.570379
C  -0.059186 -4.234143 -0.68792
C  -1.094594 -5.046065 -0.242841
C  0.977948 -4.761028 -1.441622
C  -1.0839 -6.394357 -0.563419
C  0.981533 -6.113944 -1.746438
C  -0.048794 -6.934449 -1.31376
H  1.56279 3.643872 -0.899576
H  1.278845 2.420601 1.91894
H  2.854122 0.951744 -1.833819
H  1.636207 0.005732 -0.981184
H  1.176276 1.476624 -1.834259
H  3.553623 1.728621 1.782065
H  3.193117 0.173167 1.05279
H  4.325184 1.26984 0.265757
H  3.790806 3.838667 1.207158
H  0.969931 5.654919 -0.494179
H  1.235989 6.995603 0.609671
H  2.122441 6.928174 -0.897943
H  3.38924 7.100564 2.031868
H  4.644667 5.890051 1.762061
H  4.328177 7.13499 0.55365
H  -2.840511 1.915784 0.546316
H  -0.438476 -0.898664 1.111025
H  -3.869832 0.494914 -1.060072
H  -3.705799 -1.474102 -2.537801
H  -1.902027 -3.115518 -2.244174
H  -1.896897 -4.63204 0.354707
H  1.777459 -4.113485 -1.776774
H  -1.888282 -7.02816 -0.214329
H  1.794229 -6.525158 -2.330389
H  -0.044501 -7.988447 -1.555931
totalener: -1210.08180766 hartree
nucrepener: 2459.91157400 hartree
electener: -3669.99338165 hartree
oneelecener: -6530.74559689 hartree
twoeener: 2860.75221523 hartree
kineticenergy: 1204.76315963 hartree
xcener: -118.588669820538 hartree
chargesum: -0.0000000
charge: -0.271146 -0.362020 -0.302348 -0.002172 0.112014 -0.029114 -0.042741 -0.249051 -0.280147 -0.189719 0.290701 -0.023565 -0.244167 -0.214658 0.316295 0.097888 -0.257322 -0.272279 -0.157975 0.241176 -0.101728 -0.162930 0.217235 -0.154685 -0.193018 -0.121559 -0.102784 -0.131652 0.098294 0.083692 0.091923 0.081943 0.102115 0.075012 0.095482 0.100589 0.086249 0.083570 0.084791 0.088525 0.086096 0.077139 0.085349 0.124996 0.128298 0.105565 0.128228 0.136375 0.137936 0.125648 0.129616 0.126707 0.127335
qa: -0.2711 -0.3620 -0.3023 -0.0022 0.1120 -0.0291 -0.0427 -0.2491 -0.2801 -0.1897 0.2907 -0.0236 -0.2442 -0.2147 0.3163 0.0979 -0.2573 -0.2723 -0.1580 0.2412 -0.1017 -0.1629 0.2172 -0.1547 -0.1930 -0.1216 -0.1028 -0.1317 0.0983 0.0837 0.0919 0.0819 0.1021 0.0750 0.0955 0.1006 0.0862 0.0836 0.0848 0.0885 0.0861 0.0771 0.0853 0.1250 0.1283 0.1056 0.1282 0.1364 0.1379 0.1256 0.1296 0.1267 0.1273
va: 2.1063 2.1368 2.0793 3.1235 3.8044 3.8486 3.8012 3.8911 3.9152 3.9213 4.2760 3.7750 3.9493 3.9427 3.8227 3.6283 4.0228 4.0499 4.0534 3.8035 3.9672 3.9638 3.8339 3.9535 4.0316 3.9487 3.9422 3.9502 1.0212 1.0334 1.0030 1.0069 1.0172 1.0073 1.0053 1.0000 1.0153 1.0177 0.9999 0.9986 0.9985 1.0113 0.9976 1.0180 1.0295 1.0130 1.0009 1.0032 1.0027 1.0118 0.9995 0.9993 0.9999
dispcorr: -0.025888843 hartree
energy: -1210.107696498308
dipole: 25.50625 -24.50980 0.99645 20.50413 -20.79835 -0.29422 -5.33031 4.12585 -1.20446
magnitude: 1.59066 au
magnitude: 4.04314 debye
