program: Orca
programVersion: 5.0.2
elementType: O O O N C C C C C C C C C C C C C C C C C C C C C C C C H H H H H H H H H H H H H H H H H H H H H H H H H
charge: 0
multiplicity: 1
keywords: wb97x-d3
keywords: def2-TZVPP
keywords: def2/J RIJCOSX
keywords: DEFGRID2
keywords: scfconv7
keywords: smallprint printgap noloewdin
keywords: NOSOSCF
formula: C24H25NO3
InChI: InChI=1/C24H25NO3/c1-16(2)13-20-22(24(20,3)4)23(26)28-21(15-25)17-9-8-12-19(14-17)27-18-10-6-5-7-11-18/h5-14,20-22H,1-4H3
53 atoms
O  -1.086237 1.415498 -0.500205
O  -1.068354 3.42184 0.479486
O  -1.297956 -3.61905 -0.779684
N  -2.013361 0.975513 2.743654
C  1.639236 3.920302 -0.996936
C  1.990905 3.030727 0.147176
C  0.837842 2.65698 -0.779006
C  1.048715 5.281056 -0.71476
C  2.527573 3.902623 -2.219698
C  3.21888 2.194575 0.163137
C  -0.516162 2.606274 -0.204517
C  3.287628 0.924541 0.566375
C  2.113068 0.138398 1.062718
C  4.584688 0.173381 0.54908
C  -2.303576 1.096364 0.143465
C  -2.721485 -0.275277 -0.327507
C  -2.127509 1.065317 1.60403
C  -1.779942 -1.297953 -0.330325
C  -4.028092 -0.516253 -0.714019
C  -2.159884 -2.571916 -0.719633
C  -4.39563 -1.797586 -1.105734
C  -3.472828 -2.825444 -1.108308
C  -0.113983 -3.57403 -0.093525
C  1.061949 -3.710214 -0.81284
C  -0.089205 -3.45117 1.289835
C  2.274789 -3.739578 -0.138591
C  1.128725 -3.471395 1.950359
C  2.312889 -3.618138 1.241673
H  1.666729 3.403262 1.116637
H  1.055144 1.843497 -1.461408
H  0.478936 5.31574 0.209251
H  1.853415 6.014866 -0.641949
H  0.389025 5.595885 -1.524968
H  3.374998 4.577948 -2.086792
H  2.925613 2.910741 -2.433664
H  1.974311 4.236576 -3.09878
H  4.133591 2.68044 -0.165093
H  2.337171 -0.312378 2.031755
H  1.212621 0.734485 1.183008
H  1.887786 -0.693171 0.389279
H  4.495496 -0.742307 -0.040788
H  5.399762 0.76495 0.134622
H  4.870714 -0.134378 1.557671
H  -3.078353 1.834948 -0.086757
H  -0.759354 -1.095725 -0.032103
H  -4.758421 0.28266 -0.710605
H  -5.414807 -1.996225 -1.408343
H  -3.755131 -3.825443 -1.41003
H  1.021585 -3.805321 -1.889819
H  -1.011893 -3.344309 1.845522
H  3.192791 -3.855853 -0.698896
H  1.148946 -3.376307 3.027703
H  3.259565 -3.638018 1.764416
totalener: -1210.07932519 hartree
nucrepener: 2569.66220385 hartree
electener: -3779.74152904 hartree
oneelecener: -6750.33985046 hartree
twoeener: 2970.59832142 hartree
kineticenergy: 1204.77848982 hartree
xcener: -118.592053530378 hartree
chargesum: -0.0000000
charge: -0.269363 -0.355735 -0.294906 -0.004298 0.156219 -0.026514 -0.146378 -0.255700 -0.272433 -0.228467 0.323537 0.014013 -0.213127 -0.223710 0.320065 0.036553 -0.260979 -0.138222 -0.176457 0.234884 -0.077355 -0.214868 0.219461 -0.163711 -0.152472 -0.119617 -0.119320 -0.135326 0.113967 0.090953 0.102419 0.081793 0.085075 0.091500 0.086238 0.092127 0.093794 0.095393 0.075759 0.074731 0.078259 0.082224 0.089232 0.108355 0.088514 0.111800 0.126582 0.127384 0.125945 0.137204 0.125648 0.132476 0.126854
qa: -0.2694 -0.3557 -0.2949 -0.0043 0.1562 -0.0265 -0.1464 -0.2557 -0.2724 -0.2285 0.3235 0.0140 -0.2131 -0.2237 0.3201 0.0366 -0.2610 -0.1382 -0.1765 0.2349 -0.0774 -0.2149 0.2195 -0.1637 -0.1525 -0.1196 -0.1193 -0.1353 0.1140 0.0910 0.1024 0.0818 0.0851 0.0915 0.0862 0.0921 0.0938 0.0954 0.0758 0.0747 0.0783 0.0822 0.0892 0.1084 0.0885 0.1118 0.1266 0.1274 0.1259 0.1372 0.1256 0.1325 0.1269
va: 2.1277 2.1382 2.1198 3.1120 3.7162 3.8434 3.8611 3.9018 3.9092 3.8770 4.2067 3.7198 3.9570 3.9450 3.8721 3.7673 3.9734 3.9506 4.0028 3.8476 3.9647 4.0370 3.8252 4.0050 3.9571 3.9063 3.9003 3.8839 1.0176 1.0293 1.0218 1.0015 1.0034 1.0019 1.0050 1.0067 1.0092 1.0027 1.0265 0.9982 1.0012 1.0120 0.9984 1.0201 1.0428 1.0127 1.0000 1.0133 1.0120 1.0023 1.0008 0.9996 1.0016
dispcorr: -0.029546503 hartree
energy: -1210.108871697597
dipole: 26.32882 -25.64819 0.68063 12.55446 -13.14285 -0.58839 -4.31395 2.98603 -1.32792
magnitude: 1.60401 au
magnitude: 4.07706 debye
